ACCESSION: MSBNK-Fac_Eng_Univ_Tokyo-JP000252
RECORD_TITLE: CIS-MENTHANE; EI-B; MS
DATE: 2016.01.19 (Created 2008.10.21, modified 2011.05.06)
AUTHORS: YAMAMOTO M, DEP. CHEMISTRY, FAC. SCIENCE, NARA WOMEN'S UNIV.
LICENSE: CC BY-NC-SA

CH$NAME: CIS-MENTHANE
CH$COMPOUND_CLASS: N/A
CH$FORMULA: C10H20
CH$EXACT_MASS: 140.15650
CH$SMILES: CC(C)C([H])(C1)CCC([H])(C)C1
CH$IUPAC: InChI=1S/C10H20/c1-8(2)10-6-4-9(3)5-7-10/h8-10H,4-7H2,1-3H3/t9-,10+
CH$LINK: INCHIKEY CFJYNSNXFXLKNS-AOOOYVTPSA-N
CH$LINK: COMPTOX DTXSID30884219

AC$INSTRUMENT: HITACHI RMU-6M
AC$INSTRUMENT_TYPE: EI-B
AC$MASS_SPECTROMETRY: MS_TYPE MS
AC$MASS_SPECTROMETRY: ION_MODE POSITIVE
AC$MASS_SPECTROMETRY: IONIZATION_ENERGY 70 eV

MS$FOCUSED_ION: ION_TYPE [M]+*

PK$SPLASH: splash10-0a4l-9000000000-f947b1af71f74a2011cd
PK$NUM_PEAK: 27
PK$PEAK: m/z int. rel.int.
  27 13.9 139
  28 17.9 179
  29 14.1 141
  39 1.27 13
  40 2.1 21
  41 35.9 359
  42 5 50
  43 1.24 12
  51 1.3 13
  53 5.9 59
  54 5.8 58
  55 99.99 999
  56 7.7 77
  57 3.9 39
  65 1.4 14
  67 0.67 7
  68 4 40
  69 17.7 177
  70 2.2 22
  77 0.13 1
  79 1.9 19
  81 22.4 224
  82 2.6 26
  83 0.57 6
  95 1.6 16
  140 16.1 161
  141 1.8 18