ACCESSION: MSBNK-Fac_Eng_Univ_Tokyo-JP000352
RECORD_TITLE: CIS-ISOFLAVAN-4-OL; EI-B; MS
DATE: 2016.01.19 (Created 2008.10.21, modified 2011.05.06)
AUTHORS: SASAKI S, TOYOHASHI UNIV. OF TECH.
LICENSE: CC BY-NC-SA

CH$NAME: CIS-ISOFLAVAN-4-OL
CH$NAME: 4-HYDROXY-CIS-3-PHENYLCHROMAN
CH$COMPOUND_CLASS: N/A
CH$FORMULA: C15H14O2
CH$EXACT_MASS: 226.09938
CH$SMILES: N/A
CH$IUPAC: N/A

AC$INSTRUMENT: HITACHI RMU-6D
AC$INSTRUMENT_TYPE: EI-B
AC$MASS_SPECTROMETRY: MS_TYPE MS
AC$MASS_SPECTROMETRY: ION_MODE POSITIVE
AC$MASS_SPECTROMETRY: IONIZATION_ENERGY 70 eV

MS$FOCUSED_ION: ION_TYPE [M]+*

PK$SPLASH: splash10-0zmi-0920000000-d677b69fb2d0340dfb52
PK$NUM_PEAK: 12
PK$PEAK: m/z int. rel.int.
  104 99.99 999
  105 60 600
  106 6 60
  121 0.5 5
  122 83 830
  123 8.6 86
  131 3 30
  207 0.9 9
  208 27 270
  209 4 40
  226 45 450
  227 8.3 83