ACCESSION: MSBNK-Fac_Eng_Univ_Tokyo-JP000354
RECORD_TITLE: CIS-FLAVAN-4-OL; EI-B; MS
DATE: 2016.01.19 (Created 2008.10.21, modified 2011.05.06)
AUTHORS: SASAKI S, TOYOHASHI UNIV. OF TECH.
LICENSE: CC BY-NC-SA

CH$NAME: CIS-FLAVAN-4-OL
CH$NAME: 4-HYDROXY-CIS-2-PHENYLCHROMAN
CH$COMPOUND_CLASS: N/A
CH$FORMULA: C15H14O2
CH$EXACT_MASS: 226.09938
CH$SMILES: N/A
CH$IUPAC: N/A

AC$INSTRUMENT: HITACHI RMU-6D
AC$INSTRUMENT_TYPE: EI-B
AC$MASS_SPECTROMETRY: MS_TYPE MS
AC$MASS_SPECTROMETRY: ION_MODE POSITIVE
AC$MASS_SPECTROMETRY: IONIZATION_ENERGY 70 eV

MS$FOCUSED_ION: ION_TYPE [M]+*

PK$SPLASH: splash10-0pb9-0970000000-6caab47f9b6646194c85
PK$NUM_PEAK: 14
PK$PEAK: m/z int. rel.int.
  43 1 10
  104 99.99 999
  105 14 140
  121 1.1 11
  122 28 280
  123 2.7 27
  131 10 100
  132 0.1 1
  207 27 270
  208 60 600
  209 10 100
  210 0.1 1
  226 31.3 313
  227 5 50