ACCESSION: MSBNK-Fac_Eng_Univ_Tokyo-JP001422
RECORD_TITLE: HEXAMETHYLDISILOXANE; EI-B; MS
DATE: 2016.01.19 (Created 2008.10.21, modified 2011.05.06)
AUTHORS: MASS SPECTROSCOPY SOC. OF JAPAN (MSSJ)
LICENSE: CC BY-NC-SA

CH$NAME: HEXAMETHYLDISILOXANE
CH$COMPOUND_CLASS: N/A
CH$FORMULA: C6H18OSi2
CH$EXACT_MASS: 162.08962
CH$SMILES: C[Si](C)(C)O[Si](C)(C)C
CH$IUPAC: InChI=1S/C6H18OSi2/c1-8(2,3)7-9(4,5)6/h1-6H3
CH$LINK: INCHIKEY UQEAIHBTYFGYIE-UHFFFAOYSA-N
CH$LINK: COMPTOX DTXSID4026769

AC$INSTRUMENT: JEOL JMS-D-3000
AC$INSTRUMENT_TYPE: EI-B
AC$MASS_SPECTROMETRY: MS_TYPE MS
AC$MASS_SPECTROMETRY: ION_MODE POSITIVE
AC$MASS_SPECTROMETRY: IONIZATION_ENERGY 70 eV

MS$FOCUSED_ION: ION_TYPE [M]+*

PK$SPLASH: splash10-0002-4900000000-2a77aec5b226eab8930d
PK$NUM_PEAK: 19
PK$PEAK: m/z int. rel.int.
  51 1.42 14
  52 5.05 51
  58 1.84 18
  59 13.02 130
  66 14.42 144
  67 2.04 20
  72 1.17 12
  73 17.83 178
  74 2.99 30
  75 2.15 22
  87 1.48 15
  103 1.22 12
  105 1 10
  117 1.45 15
  131 4.97 50
  133 2.01 20
  147 99.99 999
  148 16.54 165
  149 7.96 80