ACCESSION: MSBNK-Fac_Eng_Univ_Tokyo-JP005877
RECORD_TITLE: ISOPROPYL BROMIDE; EI-B; MS
DATE: 2016.01.19 (Created 2008.10.21, modified 2011.05.06)
AUTHORS: YAMAMOTO M, DEP. CHEMISTRY, FAC. SCIENCE, NARA WOMEN'S UNIV.
LICENSE: CC BY-NC-SA

CH$NAME: ISOPROPYL BROMIDE
CH$COMPOUND_CLASS: N/A
CH$FORMULA: C3H7Br
CH$EXACT_MASS: 121.97311
CH$SMILES: CC(C)Br
CH$IUPAC: InChI=1S/C3H7Br/c1-3(2)4/h3H,1-2H3
CH$LINK: INCHIKEY NAMYKGVDVNBCFQ-UHFFFAOYSA-N
CH$LINK: COMPTOX DTXSID7030197

AC$INSTRUMENT: HITACHI RMU-6M
AC$INSTRUMENT_TYPE: EI-B
AC$MASS_SPECTROMETRY: MS_TYPE MS
AC$MASS_SPECTROMETRY: ION_MODE POSITIVE
AC$MASS_SPECTROMETRY: IONIZATION_ENERGY 70 eV

MS$FOCUSED_ION: ION_TYPE [M]+*

PK$SPLASH: splash10-0006-9100000000-87049b3f8abc32cbdd1f
PK$NUM_PEAK: 16
PK$PEAK: m/z int. rel.int.
  15 1.68 17
  26 2.69 27
  27 29.29 293
  28 2 20
  38 2.02 20
  39 2.69 27
  40 11.45 115
  41 2.02 20
  42 32.32 323
  43 3.37 34
  44 99.99 999
  45 3.37 34
  106 1.68 17
  108 1.35 14
  121 11.78 118
  123 11.45 115