ACCESSION: MSBNK-Fac_Eng_Univ_Tokyo-JP005983
RECORD_TITLE: ISOPROPYL ISOBUTYRATE; CI-B; MS
DATE: 2016.01.19 (Created 2008.10.21, modified 2011.05.06)
AUTHORS: YAMAMOTO M, DEP. CHEMISTRY, FAC. SCIENCE, NARA WOMEN'S UNIV.
LICENSE: CC BY-NC-SA

CH$NAME: ISOPROPYL ISOBUTYRATE
CH$COMPOUND_CLASS: N/A
CH$FORMULA: C7H14O2
CH$EXACT_MASS: 130.09938
CH$SMILES: CC(C)OC(=O)C(C)C
CH$IUPAC: InChI=1S/C7H14O2/c1-5(2)7(8)9-6(3)4/h5-6H,1-4H3
CH$LINK: INCHIKEY WVRPFQGZHKZCEB-UHFFFAOYSA-N

AC$INSTRUMENT: HITACHI M-80
AC$INSTRUMENT_TYPE: CI-B
AC$MASS_SPECTROMETRY: MS_TYPE MS
AC$MASS_SPECTROMETRY: ION_MODE POSITIVE
AC$MASS_SPECTROMETRY: IONIZATION_ENERGY 100 eV
AC$MASS_SPECTROMETRY: REAGENT_GAS ISOBUTANE

PK$SPLASH: splash10-00dr-9000000000-fc7b39baeea595e07c10
PK$NUM_PEAK: 6
PK$PEAK: m/z int. rel.int.
  72 99.99 999
  73 6.81 68
  87 5.43 54
  88 14.26 143
  89 72.09 721
  115 4.06 41