ACCESSION: MSBNK-Fac_Eng_Univ_Tokyo-JP006028
RECORD_TITLE: HEXAMETHYLDISILANE; EI-B; MS
DATE: 2016.01.19 (Created 2008.10.21, modified 2011.05.06)
AUTHORS: YAMAMOTO M, DEP. CHEMISTRY, FAC. SCIENCE, NARA WOMEN'S UNIV.
LICENSE: CC BY-NC-SA

CH$NAME: HEXAMETHYLDISILANE
CH$COMPOUND_CLASS: N/A
CH$FORMULA: C6H18Si2
CH$EXACT_MASS: 146.09470
CH$SMILES: C[Si](C)(C)[Si](C)(C)C
CH$IUPAC: InChI=1S/C6H18Si2/c1-7(2,3)8(4,5)6/h1-6H3
CH$LINK: INCHIKEY NEXSMEBSBIABKL-UHFFFAOYSA-N
CH$LINK: COMPTOX DTXSID2061698

AC$INSTRUMENT: HITACHI RMU-6M
AC$INSTRUMENT_TYPE: EI-B
AC$MASS_SPECTROMETRY: MS_TYPE MS
AC$MASS_SPECTROMETRY: ION_MODE POSITIVE
AC$MASS_SPECTROMETRY: IONIZATION_ENERGY 20 eV

MS$FOCUSED_ION: ION_TYPE [M]+*

PK$SPLASH: splash10-00di-9400000000-3d34b9239adcd91da72d
PK$NUM_PEAK: 19
PK$PEAK: m/z int. rel.int.
  28 1.1 11
  43 0.6 6
  44 0.7 7
  45 0.11 1
  58 1.1 11
  72 2.7 27
  73 99.99 999
  74 0.87 9
  75 3.8 38
  115 1 10
  116 0.5 5
  129 0.06 1
  131 24.5 245
  132 4.2 42
  133 2.3 23
  145 0.08 1
  146 17.8 178
  147 3.3 33
  148 1.7 17