ACCESSION: MSBNK-Fac_Eng_Univ_Tokyo-JP006591
RECORD_TITLE: CIS-LIMONENE-1,2-OXIDE; EI-B; MS
DATE: 2016.01.19 (Created 2008.10.21, modified 2011.05.06)
AUTHORS: HISAHIRO HAGIWARA, CHEMICAL RESEARCH INSTITUTE OF NON-AQUEOUSSOLUTIONS TOHOKU UNIV.
LICENSE: CC BY-NC-SA

CH$NAME: CIS-LIMONENE-1,2-OXIDE
CH$COMPOUND_CLASS: N/A
CH$FORMULA: C10H16O
CH$EXACT_MASS: 152.12012
CH$SMILES: N/A
CH$IUPAC: N/A

AC$INSTRUMENT: HITACHI M-80B
AC$INSTRUMENT_TYPE: EI-B
AC$MASS_SPECTROMETRY: MS_TYPE MS
AC$MASS_SPECTROMETRY: ION_MODE POSITIVE
AC$MASS_SPECTROMETRY: IONIZATION_ENERGY 70 eV

MS$FOCUSED_ION: ION_TYPE [M]+*

PK$SPLASH: splash10-0006-9100000000-64a480fce9791889408d
PK$NUM_PEAK: 53
PK$PEAK: m/z int. rel.int.
  15 2.71 27
  27 21.2 212
  29 7.91 79
  38 1.02 10
  39 29.93 299
  40 4.84 48
  41 42.26 423
  42 3.52 35
  43 99.99 999
  44 16.08 161
  45 2.47 25
  50 1.08 11
  51 3.69 37
  52 2.21 22
  53 15.78 158
  54 3.5 35
  55 19.91 199
  56 3.01 30
  57 1.52 15
  58 1.16 12
  63 1.11 11
  65 3.42 34
  66 2.29 23
  67 45.73 457
  68 13.51 135
  69 8.83 88
  70 1.08 11
  71 5.59 56
  77 5.98 60
  78 1.46 15
  79 30.86 309
  80 4.65 47
  81 33.06 331
  82 8.44 84
  83 5.49 55
  84 10.84 108
  91 5.51 55
  92 2.57 26
  93 29.47 295
  94 57.75 578
  95 15.21 152
  96 2.14 21
  97 2.22 22
  105 1.88 19
  106 1.08 11
  107 2.8 28
  108 37.69 377
  109 14.22 142
  110 1.75 18
  119 2.96 30
  121 2.25 23
  123 2.38 24
  137 3.4 34