ACCESSION: MSBNK-Fac_Eng_Univ_Tokyo-JP007383
RECORD_TITLE: CIS-MENTHONE; EI-B; MS
DATE: 2016.01.19 (Created 2008.10.21, modified 2011.05.06)
AUTHORS: YAMAMOTO M, DEP. CHEMISTRY, FAC. SCIENCE, NARA WOMEN'S UNIV.
LICENSE: CC BY-NC-SA

CH$NAME: CIS-MENTHONE
CH$NAME: CIS-5-METHYL-2-(1-METHYLETHYL)CYCLOHEXANONE
CH$COMPOUND_CLASS: N/A
CH$FORMULA: C10H18O
CH$EXACT_MASS: 154.13577
CH$SMILES: N/A
CH$IUPAC: N/A
CH$LINK: CAS 491-07-6

AC$INSTRUMENT: HITACHI M-80
AC$INSTRUMENT_TYPE: EI-B
AC$MASS_SPECTROMETRY: MS_TYPE MS
AC$MASS_SPECTROMETRY: ION_MODE POSITIVE
AC$MASS_SPECTROMETRY: IONIZATION_ENERGY 70 eV

MS$FOCUSED_ION: ION_TYPE [M]+*

PK$SPLASH: splash10-03di-8900000000-8b6b14ca916e269aa1f5
PK$NUM_PEAK: 33
PK$PEAK: m/z int. rel.int.
  42 3.69 37
  43 11.11 111
  55 19.38 194
  56 17.04 170
  57 4.36 44
  58 1.34 13
  67 1.93 19
  68 2.65 27
  69 39.56 396
  70 20.59 206
  71 3.49 35
  81 1.99 20
  83 14.04 140
  84 9.81 98
  85 2.1 21
  93 1.85 19
  94 1.7 17
  95 9.42 94
  96 1.48 15
  97 18.49 185
  98 6.94 69
  107 1.11 11
  109 1.23 12
  110 5.9 59
  111 17.56 176
  112 99.99 999
  113 6.93 69
  121 3.85 39
  125 5.21 52
  139 32.64 326
  140 2.22 22
  154 19.27 193
  155 2.46 25