ACCESSION: MSBNK-Fac_Eng_Univ_Tokyo-JP007404
RECORD_TITLE: CIS-DECAHYDROQUINOLINE; EI-B; MS
DATE: 2016.01.19 (Created 2008.10.21, modified 2011.05.06)
AUTHORS: YAMAMOTO M, DEP. CHEMISTRY, FAC. SCIENCE, NARA WOMEN'S UNIV.
LICENSE: CC BY-NC-SA

CH$NAME: CIS-DECAHYDROQUINOLINE
CH$COMPOUND_CLASS: N/A
CH$FORMULA: C9H17N
CH$EXACT_MASS: 139.1361
CH$SMILES: N/A
CH$IUPAC: N/A

AC$INSTRUMENT: HITACHI RMU-6M
AC$INSTRUMENT_TYPE: EI-B
AC$MASS_SPECTROMETRY: MS_TYPE MS
AC$MASS_SPECTROMETRY: ION_MODE POSITIVE
AC$MASS_SPECTROMETRY: IONIZATION_ENERGY 70 eV

MS$FOCUSED_ION: ION_TYPE [M]+*

PK$SPLASH: splash10-0002-9100000000-e71a21a5454efd590cb0
PK$NUM_PEAK: 33
PK$PEAK: m/z int. rel.int.
  27 4.62 46
  28 6.92 69
  29 3.85 39
  30 7.08 71
  42 3.54 35
  43 3.38 34
  44 3.23 32
  51 1.07 11
  52 0.9 9
  53 3.23 32
  54 3.85 39
  55 4 40
  56 5.38 54
  57 2.46 25
  65 1.07 11
  67 4.31 43
  68 4.92 49
  69 2.31 23
  70 2.62 26
  77 2.31 23
  81 3.08 31
  82 7.85 79
  83 6.31 63
  84 2.31 23
  93 1.07 11
  94 1.07 11
  95 1.5 15
  96 99.99 999
  97 8.46 85
  110 3.23 32
  138 6.15 62
  139 13.85 139
  140 2.92 29