ACCESSION: MSBNK-Fac_Eng_Univ_Tokyo-JP008388
RECORD_TITLE: CIS-LINALOOL OXIDE; EI-B; MS
DATE: 2016.01.19 (Created 2008.10.21, modified 2011.05.06)
AUTHORS: SODA AROMATIC CO., LTD.
LICENSE: CC BY-NC-SA

CH$NAME: CIS-LINALOOL OXIDE
CH$COMPOUND_CLASS: N/A
CH$FORMULA: C10H18O2
CH$EXACT_MASS: 170.13068
CH$SMILES: N/A
CH$IUPAC: N/A

AC$INSTRUMENT: HITACHI M-80B
AC$INSTRUMENT_TYPE: EI-B
AC$MASS_SPECTROMETRY: MS_TYPE MS
AC$MASS_SPECTROMETRY: ION_MODE POSITIVE
AC$MASS_SPECTROMETRY: IONIZATION_ENERGY 70 eV

MS$FOCUSED_ION: ION_TYPE [M]+*

PK$SPLASH: splash10-052f-9000000000-3e85a74ebced965a551d
PK$NUM_PEAK: 48
PK$PEAK: m/z int. rel.int.
  15 2.41 24
  27 9.47 95
  29 5.46 55
  31 9.1 91
  39 8.76 88
  40 1.42 14
  41 24.12 241
  42 3.39 34
  43 45.4 454
  44 2.07 21
  45 2.38 24
  51 1.3 13
  53 6.3 63
  54 1.5 15
  55 29.98 300
  56 2.46 25
  57 3.87 39
  58 1.34 13
  59 99.99 999
  60 3.15 32
  65 1.92 19
  66 1.16 12
  67 19.97 200
  68 31.98 320
  69 9.68 97
  70 5.74 57
  71 9.19 92
  72 5.43 54
  73 1.56 16
  77 2.97 30
  79 6.3 63
  81 17.01 170
  82 2.98 30
  83 12.6 126
  84 4.35 44
  85 5.42 54
  91 2.33 23
  93 28.19 282
  94 42.69 427
  95 5.65 57
  97 6.54 65
  102 1.75 18
  109 2.32 23
  110 1.14 11
  111 28.64 286
  112 4.79 48
  137 3.83 38
  155 5.96 60