ACCESSION: MSBNK-Fac_Eng_Univ_Tokyo-JP009519
RECORD_TITLE: HEXAMETHYLDISILAZANE; EI-B; MS
DATE: 2016.01.19 (Created 2008.10.21, modified 2011.05.06)
AUTHORS: NARA WOMEN'S UNIVERSITY
LICENSE: CC BY-NC-SA

CH$NAME: HEXAMETHYLDISILAZANE
CH$COMPOUND_CLASS: N/A
CH$FORMULA: C6H19NSi2
CH$EXACT_MASS: 161.10560
CH$SMILES: C[Si](C)(C)N[Si](C)(C)C
CH$IUPAC: InChI=1S/C6H19NSi2/c1-8(2,3)7-9(4,5)6/h7H,1-6H3
CH$LINK: CAS 999-97-3
CH$LINK: INCHIKEY FFUAGWLWBBFQJT-UHFFFAOYSA-N
CH$LINK: COMPTOX DTXSID2025395

AC$INSTRUMENT: HITACHI M-80
AC$INSTRUMENT_TYPE: EI-B
AC$MASS_SPECTROMETRY: MS_TYPE MS
AC$MASS_SPECTROMETRY: ION_MODE POSITIVE
AC$MASS_SPECTROMETRY: IONIZATION_ENERGY 16 eV

MS$FOCUSED_ION: ION_TYPE [M]+*

PK$SPLASH: splash10-0002-0900000000-763635cc1c34147764f4
PK$NUM_PEAK: 9
PK$PEAK: m/z int. rel.int.
  75 1.06 11
  130 5.85 59
  131 1.02 10
  146 99.99 999
  147 85.78 858
  148 17.98 180
  149 5.99 60
  161 6.13 61
  162 1.03 10