ACCESSION: MSBNK-Fac_Eng_Univ_Tokyo-JP010237
RECORD_TITLE: CIS-N-METHYL-4-ACRYLOYL-4-CYCLOHEXENE-1,2-DICARBOXIMIDE; EI-B; MS
DATE: 2016.01.19 (Created 2008.10.21, modified 2011.05.06)
AUTHORS: KANEMASA S, INST. OF ADVANCED MATERIAL STUDY KYUSHU UNIV.
LICENSE: CC BY-NC-SA

CH$NAME: CIS-N-METHYL-4-ACRYLOYL-4-CYCLOHEXENE-1,2-DICARBOXIMIDE
CH$COMPOUND_CLASS: N/A
CH$FORMULA: C12H13NO3
CH$EXACT_MASS: 219.08954
CH$SMILES: N/A
CH$IUPAC: N/A

AC$INSTRUMENT: JEOL JMS-01-SG-2
AC$INSTRUMENT_TYPE: EI-B
AC$MASS_SPECTROMETRY: MS_TYPE MS
AC$MASS_SPECTROMETRY: ION_MODE POSITIVE
AC$MASS_SPECTROMETRY: IONIZATION_ENERGY 75 eV

MS$FOCUSED_ION: ION_TYPE [M]+*

PK$SPLASH: splash10-056u-9200000000-02c9d4c5b77e61ffb026
PK$NUM_PEAK: 44
PK$PEAK: m/z int. rel.int.
  39 26.29 263
  41 31.25 313
  42 10.97 110
  43 99.99 999
  44 19.19 192
  45 16.5 165
  51 22.34 223
  53 15.92 159
  55 78.49 785
  56 16.85 169
  57 22.66 227
  58 24.1 241
  69 17.79 178
  77 67.91 679
  78 29.49 295
  79 80.66 807
  80 20.44 204
  91 16.85 169
  92 15.91 159
  105 29.64 296
  106 11.26 113
  107 16.27 163
  108 23.56 236
  109 3.24 32
  110 3.2 32
  111 2.71 27
  112 11.95 120
  113 14.94 149
  114 2.62 26
  115 6.22 62
  116 9.11 91
  117 3.79 38
  119 3.42 34
  120 2.75 28
  121 4.86 49
  129 2.79 28
  133 20.84 208
  134 16.37 164
  135 4.66 47
  149 3.87 39
  192 5.68 57
  218 3.3 33
  219 36.61 366
  220 4.23 42