ACCESSION: MSBNK-Fac_Eng_Univ_Tokyo-JP010344
RECORD_TITLE: N-BENZOYL-PARA-ANISIDINE; EI-B; MS
DATE: 2016.01.19 (Created 2008.10.21, modified 2011.05.06)
AUTHORS: TAJIMA S, GUNMA COLLEGE OF TECHNOLOGY
LICENSE: CC BY-NC-SA

CH$NAME: N-BENZOYL-PARA-ANISIDINE
CH$NAME: 4-METHOXY-N-BENZOYLANILINE
CH$COMPOUND_CLASS: N/A
CH$FORMULA: C14H13NO2
CH$EXACT_MASS: 227.09463
CH$SMILES: COc(c2)ccc(c2)NC(=O)c(c1)cccc1
CH$IUPAC: InChI=1S/C14H13NO2/c1-17-13-9-7-12(8-10-13)15-14(16)11-5-3-2-4-6-11/h2-10H,1H3,(H,15,16)
CH$LINK: INCHIKEY KEEBHMMBUBEEOV-UHFFFAOYSA-N
CH$LINK: COMPTOX DTXSID90225705

AC$INSTRUMENT: HITACHI M-80A
AC$INSTRUMENT_TYPE: EI-B
AC$MASS_SPECTROMETRY: MS_TYPE MS
AC$MASS_SPECTROMETRY: ION_MODE POSITIVE
AC$MASS_SPECTROMETRY: IONIZATION_ENERGY 70 eV

MS$FOCUSED_ION: ION_TYPE [M]+*

PK$SPLASH: splash10-0a6r-6950000000-3c529ae2c5c42d7662c6
PK$NUM_PEAK: 24
PK$PEAK: m/z int. rel.int.
  15 1.66 17
  27 1.34 13
  39 1.94 19
  41 2.5 25
  50 3.43 34
  51 10.92 109
  52 5.16 52
  53 3.02 30
  63 1.61 16
  64 1.25 13
  65 1.35 14
  76 1.57 16
  77 35.45 355
  78 3.69 37
  79 1.44 14
  80 1.6 16
  95 3.47 35
  105 99.99 999
  106 8.2 82
  107 1.13 11
  122 1.35 14
  124 2.42 24
  227 53.8 538
  228 9.12 91