ACCESSION: MSBNK-MSSJ-MSJ02361
RECORD_TITLE: 3-Aminobutanoic acid; GC-FI-TOF; MS; POSITIVE; FI; 10 kV; 2TBDMS
DATE: 2022.09.30
AUTHORS: Eiyu Imai, Molecular Structure Characterization Unit, RIKEN
LICENSE: CC BY
COPYRIGHT: Eiyu Imai, Molecular Structure Characterization Unit, RIKEN
COMMENT: This record was created by the financial support of MEXT/JSPS KAKENHI Grant Number 22HP8019 to the Mass Spectrometry Society of Japan.
COMMENT: Original ID of the mass spectral data was 2201b1T2_fi.xlsx.
COMMENT: JMS-T100GCV (JEOL, Akishima, Japan) is a reflectron time-of-flight (reTOF) mass spectrometer. Temperature of GC-transfer line was 250 C. Resolving power (FWHM, nominal) was 7000.
COMMENT: FI voltage was 10 kV. Typical accuracy level expected was 10 ppm. The m/z value was adjusted with 274.16586.

CH$NAME: 3-Aminobutanoic acid
CH$COMPOUND_CLASS: Non-natural compound
CH$FORMULA: C4H9NO2
CH$EXACT_MASS: 103.0633285
CH$SMILES: CC(CC(=O)O)N
CH$IUPAC: InChI=1S/C4H9NO2/c1-3(5)2-4(6)7/h3H,2,5H2,1H3,(H,6,7)
CH$LINK: CHEMSPIDER 10469
CH$LINK: INCHIKEY OQEBBZSWEGYTPG-UHFFFAOYSA-N
CH$LINK: PUBCHEM CID:10932

AC$INSTRUMENT: JMS-T100GCV (JEOL, Akishima, Japan) coupled to Agilent 7890A (Santa Clara, CA, USA) gas chromatograph.
AC$INSTRUMENT_TYPE: GC-FI-TOF
AC$MASS_SPECTROMETRY: MS_TYPE MS
AC$MASS_SPECTROMETRY: ION_MODE POSITIVE
AC$MASS_SPECTROMETRY: IONIZATION FI
AC$CHROMATOGRAPHY: CARRIER_GAS He, 1 ml/min
AC$CHROMATOGRAPHY: COLUMN_NAME DB-5MS UI 122-5532UI US0462866H (Agilent, Wilmington, USA) with the length 30 m, I.D. 0.25 mm, and thickness 0.25 micrometer.
AC$CHROMATOGRAPHY: COLUMN_TEMPERATURE Held at 70 C for 4 min and ramped at the rate of 30 C/min to 325 C and held at the final temperature for 1.5 min.
AC$CHROMATOGRAPHY: INJECTION_TEMPERATURE 250 C
AC$CHROMATOGRAPHY: RETENTION_TIME 9.67 min.

MS$FOCUSED_ION: DERIVATIVE_FORM C16H37NO2Si2
MS$FOCUSED_ION: DERIVATIVE_MASS 331.23628
MS$FOCUSED_ION: DERIVATIVE_TYPE 2TBDMS

PK$SPLASH: splash10-00di-0090000000-94ac4852a97a8ec39d36
PK$NUM_PEAK: 12
PK$PEAK: m/z int. rel.int.
  57.071 0.7971 8
  158.136 0.2657 3
  274.166 100 999
  274.759 0.216 2
  274.984 0.3079 3
  275.168 23.2051 232
  276.165 9.2305 92
  276.818 0.1241 1
  277.166 1.4246 14
  278.165 0.2761 3
  332.246 0.3866 4
  333.245 0.1254 1