ACCESSION: MSBNK-Osaka_Univ-OUF00199
RECORD_TITLE: DL-Norvaline; GC-EI-TOF; MS; n TMS; RT:404.641 sec
DATE: 2016.01.19 (Created 2010.05.20, modified 2013.04.24)
AUTHORS: Tsujimoto Y, Tsugawa H, Bamba T, Fukusaki E, engineering department, Osaka Univ.
LICENSE: CC BY-SA
COMMENT: The chemical compound was chemically modified with N-methyl-N-trimethylsilyl-trifluoroacetamide (MSTFA) before GC-MS analysis. When it has two or more functional groups, this modification gave a mixture of the TMS derivatives having different number of TMS groups at different functional groups.

CH$NAME: DL-Norvaline
CH$COMPOUND_CLASS: Natural Product
CH$FORMULA: C5H11NO2
CH$EXACT_MASS: 117.07898
CH$SMILES: CC(C)C(N)C(O)=O
CH$IUPAC: InChI=1S/C5H11NO2/c1-3(2)4(6)5(7)8/h3-4H,6H2,1-2H3,(H,7,8)
CH$LINK: CAS 760-78-1
CH$LINK: CHEBI 27266 32859 32860
CH$LINK: CHEMSPIDER 1148
CH$LINK: PUBCHEM CID:1182
CH$LINK: INCHIKEY KZSNJWFQEVHDMF-UHFFFAOYSA-N
CH$LINK: COMPTOX DTXSID70859522

AC$INSTRUMENT: Pegasus III TOF-MS system, Leco; GC 6890, Agilent Technologies
AC$INSTRUMENT_TYPE: GC-EI-TOF
AC$MASS_SPECTROMETRY: MS_TYPE MS
AC$MASS_SPECTROMETRY: ION_MODE POSITIVE
AC$MASS_SPECTROMETRY: HELIUM_FLOW 1 ml/min
AC$MASS_SPECTROMETRY: ION_SOURCE_TEMPERATURE 200 C
AC$MASS_SPECTROMETRY: SCAN_RANGE_M/Z 85-500
AC$CHROMATOGRAPHY: COLUMN_NAME CP-SIL 8 CB LOW BLEED/MS
AC$CHROMATOGRAPHY: INJECTION_TEMPERATURE 230 C
AC$CHROMATOGRAPHY: OVEN_TEMPERATURE 80 C (Duration 2 min)-330 C (rate: 15 C/min; Duration 6 min)
AC$CHROMATOGRAPHY: RETENTION_INDEX 1232.693
AC$CHROMATOGRAPHY: RETENTION_TIME 404.641 sec
AC$CHROMATOGRAPHY: TRANSFARLINE_TEMPERATURE 250 C

MS$DATA_PROCESSING: WHOLE ChromaTOF ver. 2.32 (LECO)

PK$SPLASH: splash10-0006-0900000000-707feed53143f79f126b
PK$NUM_PEAK: 65
PK$PEAK: m/z int. rel.int.
  85 11 11
  86 20 20
  87 10 10
  88 5 5
  89 3 3
  94 3 3
  95 1 1
  96 2 2
  97 2 2
  98 10 10
  99 7 7
  100 83 83
  101 16 16
  102 25 25
  103 34 34
  104 4 4
  105 7 7
  107 1 1
  110 2 2
  111 1 1
  112 4 4
  113 3 3
  114 25 25
  115 24 24
  116 8 8
  117 19 19
  118 4 4
  119 7 7
  120 1 1
  126 1 1
  128 21 21
  129 9 9
  130 15 15
  131 21 21
  132 17 17
  133 37 37
  134 7 7
  135 3 3
  142 7 7
  143 3 3
  144 999 999
  145 138 138
  146 49 49
  147 178 178
  148 30 30
  149 17 17
  150 2 2
  156 21 21
  157 5 5
  158 9 9
  159 3 3
  160 2 2
  163 1 1
  172 3 3
  174 5 5
  175 1 1
  202 5 5
  203 2 2
  204 1 1
  218 63 63
  219 18 18
  220 7 7
  221 1 1
  246 11 11
  247 2 2