ACCESSION: MSBNK-CASMI_2012-SMI00131
RECORD_TITLE: Benzyldiphenylphosphine oxide; APCI-ITFT; MS2; CE:45 CID;
DATE: 2012.08.31 (Created 2012.08.31)
AUTHORS: S. Neumann: IPB-Halle, Germany & E. Schymanski: Eawag, Switzerland
LICENSE: CC BY
COPYRIGHT: CASMI2012
PUBLICATION: Schymanski, E.; Neumann, S. The Critical Assessment of Small Molecule Identification (CASMI): Challenges and Solutions. Metabolites 2013, 3 (3), 517–38. DOI:10.3390/metabo3030517
COMMENT: http://casmi-contest.org/challenges-cat1-2.shtml
COMMENT: CASMI2012 LC Challenge 13

CH$NAME: Benzyldiphenylphosphine oxide
CH$COMPOUND_CLASS: N/A; Unknown for CASMI
CH$FORMULA: C19H17OP
CH$EXACT_MASS: 292.102
CH$SMILES: C1=CC=C(C=C1)CP(=O)(C2=CC=CC=C2)C3=CC=CC=C3
CH$IUPAC: InChI=1S/C19H17OP/c20-21(18-12-6-2-7-13-18,19-14-8-3-9-15-19)16-17-10-4-1-5-11-17/h1-15H,16H2
CH$LINK: PUBCHEM CID:76293
CH$LINK: CHEMSPIDER 68772
CH$LINK: INCHIKEY NXGAOFONOFYCNG-UHFFFAOYSA-N
CH$LINK: COMPTOX DTXSID10183772

AC$INSTRUMENT: LTQ-Orbitrap
AC$INSTRUMENT_TYPE: APCI-ITFT
AC$MASS_SPECTROMETRY: MS_TYPE MS2
AC$MASS_SPECTROMETRY: ION_MODE POSITIVE
AC$MASS_SPECTROMETRY: COLLISION_ENERGY 45 CID
AC$MASS_SPECTROMETRY: IONIZATION APCI
AC$MASS_SPECTROMETRY: RESOLUTION 15000
AC$CHROMATOGRAPHY: FLOW_GRADIENT DIRECT INJECTION
AC$CHROMATOGRAPHY: RETENTION_TIME 0.58-0.89 min

MS$FOCUSED_ION: PRECURSOR_M/Z 293.110
MS$FOCUSED_ION: PRECURSOR_TYPE [M+H]+

PK$SPLASH: splash10-0udl-5190000000-b1bb8db8b4ab44c0751c
PK$NUM_PEAK: 8
PK$PEAK: m/z int. rel.int.
  91.0541 2211410.3 873
  125.0152 130666.3 52
  167.0859 161086.1 64
  185.0519 125915.7 50
  201.0469 2531123 999
  215.0626 371698.1 147
  219.0576 223408.9 88
  233.0733 226928.3 90