ACCESSION: MSBNK-CASMI_2016-SM804205
RECORD_TITLE: 3-Methylpyridazine; LC-ESI-QFT; MS2; CE: 35 NCE; R=35000; [M+H]+
DATE: 2016.12.12
AUTHORS: Krauss M, Schymanski EL, Weidauer C, Schupke H, UFZ and Eawag
LICENSE: CC BY
COPYRIGHT: Copyright (C) 2016 UFZ/Eawag
PUBLICATION: Schymanski, E. L.; Ruttkies, C.; Krauss, M.; Brouard, C.; Kind, T.; Dührkop, K.; Allen, F.; Vaniya, A.; Verdegem, D.; Böcker, S.; et al. Critical Assessment of Small Molecule Identification 2016: Automated Methods. Journal of Cheminformatics 2017, 9 (1). DOI:10.1186/s13321-017-0207-1
COMMENT: CONFIDENCE standard compound
COMMENT: INTERNAL_ID 8042

CH$NAME: 3-Methylpyridazine
CH$NAME: 3-methylpyridazine
CH$COMPOUND_CLASS: N/A; Environmental Standard
CH$FORMULA: C5H6N2
CH$EXACT_MASS: 94.05310
CH$SMILES: CC1=CC=CN=N1
CH$IUPAC: InChI=1S/C5H6N2/c1-5-3-2-4-6-7-5/h2-4H,1H3
CH$LINK: CAS 1632-76-4
CH$LINK: PUBCHEM CID:74208
CH$LINK: INCHIKEY MXDRPNGTQDRKQM-UHFFFAOYSA-N
CH$LINK: CHEMSPIDER 66816
CH$LINK: COMPTOX DTXSID80167529

AC$INSTRUMENT: Q Exactive Plus Orbitrap Thermo Scientific
AC$INSTRUMENT_TYPE: LC-ESI-QFT
AC$MASS_SPECTROMETRY: MS_TYPE MS2
AC$MASS_SPECTROMETRY: ION_MODE POSITIVE
AC$MASS_SPECTROMETRY: IONIZATION ESI
AC$MASS_SPECTROMETRY: FRAGMENTATION_MODE HCD
AC$MASS_SPECTROMETRY: COLLISION_ENERGY 35 (nominal)
AC$MASS_SPECTROMETRY: RESOLUTION 35000
AC$CHROMATOGRAPHY: COLUMN_NAME Kinetex C18 EVO 2.6 um, 2.1x50 mm, precolumn 2.1x5 mm, Phenomenex
AC$CHROMATOGRAPHY: FLOW_GRADIENT 95/5 at 0 min, 95/5 at 1 min, 0/100 at 13 min, 0/100 at 24 min
AC$CHROMATOGRAPHY: FLOW_RATE 300 uL/min
AC$CHROMATOGRAPHY: RETENTION_TIME 0.555 min
AC$CHROMATOGRAPHY: SOLVENT A water with 0.1% formic acid
AC$CHROMATOGRAPHY: SOLVENT B methanol with 0.1% formic acid

MS$FOCUSED_ION: BASE_PEAK 95.0602
MS$FOCUSED_ION: PRECURSOR_M/Z 95.0604
MS$FOCUSED_ION: PRECURSOR_TYPE [M+H]+
MS$DATA_PROCESSING: RECALIBRATE loess on assigned fragments and MS1
MS$DATA_PROCESSING: REANALYZE Peaks with additional N2/O included
MS$DATA_PROCESSING: WHOLE RMassBank 2.3.1

PK$SPLASH: splash10-0002-9000000000-e9554e3841330960d19f
PK$ANNOTATION: m/z tentative_formula formula_count mass error(ppm)
  65.0386 C5H5+ 1 65.0386 0.86
  67.0417 C4H5N+ 1 67.0417 1
  67.0543 C5H7+ 1 67.0542 1.18
  68.0495 C4H6N+ 1 68.0495 0.71
  78.0339 C5H4N+ 1 78.0338 0.65
  95.0603 C5H7N2+ 1 95.0604 -0.64
PK$NUM_PEAK: 6
PK$PEAK: m/z int. rel.int.
  65.0386 506403.7 2
  67.0417 1475324 6
  67.0543 401974.6 1
  68.0495 3848936.2 17
  78.0339 579809.8 2
  95.0603 216129056 999