ACCESSION: MSBNK-CASMI_2016-SM812904
RECORD_TITLE: Phenazine; LC-ESI-QFT; MS2; CE: 35 NCE; R=35000; [M+H]+
DATE: 2016.12.12
AUTHORS: Krauss M, Schymanski EL, Weidauer C, Schupke H, UFZ and Eawag
LICENSE: CC BY
COPYRIGHT: Copyright (C) 2016 UFZ/Eawag
PUBLICATION: Schymanski, E. L.; Ruttkies, C.; Krauss, M.; Brouard, C.; Kind, T.; Dührkop, K.; Allen, F.; Vaniya, A.; Verdegem, D.; Böcker, S.; et al. Critical Assessment of Small Molecule Identification 2016: Automated Methods. Journal of Cheminformatics 2017, 9 (1). DOI:10.1186/s13321-017-0207-1
COMMENT: CONFIDENCE standard compound
COMMENT: INTERNAL_ID 8129

CH$NAME: Phenazine
CH$COMPOUND_CLASS: N/A; Environmental Standard
CH$FORMULA: C12H8N2
CH$EXACT_MASS: 180.06875
CH$SMILES: C1=CC2=NC3=CC=CC=C3N=C2C=C1
CH$IUPAC: InChI=1S/C12H8N2/c1-2-6-10-9(5-1)13-11-7-3-4-8-12(11)14-10/h1-8H
CH$LINK: CAS 92-82-0
CH$LINK: CHEBI 36674
CH$LINK: PUBCHEM CID:4757
CH$LINK: INCHIKEY PCNDJXKNXGMECE-UHFFFAOYSA-N
CH$LINK: CHEMSPIDER 4593
CH$LINK: COMPTOX DTXSID2059069

AC$INSTRUMENT: Q Exactive Plus Orbitrap Thermo Scientific
AC$INSTRUMENT_TYPE: LC-ESI-QFT
AC$MASS_SPECTROMETRY: MS_TYPE MS2
AC$MASS_SPECTROMETRY: ION_MODE POSITIVE
AC$MASS_SPECTROMETRY: IONIZATION ESI
AC$MASS_SPECTROMETRY: FRAGMENTATION_MODE HCD
AC$MASS_SPECTROMETRY: COLLISION_ENERGY 35 (nominal)
AC$MASS_SPECTROMETRY: RESOLUTION 35000
AC$CHROMATOGRAPHY: COLUMN_NAME Kinetex C18 EVO 2.6 um, 2.1x50 mm, precolumn 2.1x5 mm, Phenomenex
AC$CHROMATOGRAPHY: FLOW_GRADIENT 95/5 at 0 min, 95/5 at 1 min, 0/100 at 13 min, 0/100 at 24 min
AC$CHROMATOGRAPHY: FLOW_RATE 300 uL/min
AC$CHROMATOGRAPHY: RETENTION_TIME 10.128 min
AC$CHROMATOGRAPHY: SOLVENT A water with 0.1% formic acid
AC$CHROMATOGRAPHY: SOLVENT B methanol with 0.1% formic acid

MS$FOCUSED_ION: BASE_PEAK 181.0757
MS$FOCUSED_ION: PRECURSOR_M/Z 181.076
MS$FOCUSED_ION: PRECURSOR_TYPE [M+H]+
MS$DATA_PROCESSING: RECALIBRATE loess on assigned fragments and MS1
MS$DATA_PROCESSING: REANALYZE Peaks with additional N2/O included
MS$DATA_PROCESSING: WHOLE RMassBank 2.3.1

PK$SPLASH: splash10-001i-0900000000-50289093a350922ea293
PK$ANNOTATION: m/z tentative_formula formula_count mass error(ppm)
  111.0231 C9H3+ 1 111.0229 1.42
  121.0076 C10H+ 1 121.0073 2.6
  154.0645 C11H8N+ 1 154.0651 -4.29
  180.0678 C12H8N2+ 1 180.0682 -2.05
  181.0758 C12H9N2+ 1 181.076 -1
PK$NUM_PEAK: 5
PK$PEAK: m/z int. rel.int.
  111.0231 372380.6 1
  121.0076 584593.3 1
  154.0645 357700.9 1
  180.0678 511897.1 1
  181.0758 356871392 999