ACCESSION: MSBNK-Fac_Eng_Univ_Tokyo-JP000240
RECORD_TITLE: 1,1,3,3-TETRAMETHYL-1-BUTYLAMINE; EI-B; MS
DATE: 2016.01.19 (Created 2008.10.21, modified 2011.05.06)
AUTHORS: YAMAMOTO M, DEP. CHEMISTRY, FAC. SCIENCE, NARA WOMEN'S UNIV.
LICENSE: CC BY-NC-SA

CH$NAME: 1,1,3,3-TETRAMETHYL-1-BUTYLAMINE
CH$COMPOUND_CLASS: N/A
CH$FORMULA: C8H19N
CH$EXACT_MASS: 129.15175
CH$SMILES: CC(C)(C)CC(C)(C)N
CH$IUPAC: InChI=1S/C8H19N/c1-7(2,3)6-8(4,5)9/h6,9H2,1-5H3
CH$LINK: INCHIKEY QIJIUJYANDSEKG-UHFFFAOYSA-N
CH$LINK: COMPTOX DTXSID0021886

AC$INSTRUMENT: HITACHI RMU-6M
AC$INSTRUMENT_TYPE: EI-B
AC$MASS_SPECTROMETRY: MS_TYPE MS
AC$MASS_SPECTROMETRY: ION_MODE POSITIVE
AC$MASS_SPECTROMETRY: IONIZATION_ENERGY 70 eV

MS$FOCUSED_ION: ION_TYPE [M]+*

PK$SPLASH: splash10-0a4i-9000000000-28304328da7c10cefb28
PK$NUM_PEAK: 16
PK$PEAK: m/z int. rel.int.
  15 1.9 19
  18 7.6 76
  27 3.5 35
  28 0.21 2
  29 5.4 54
  30 3.3 33
  39 3.7 37
  41 1.03 10
  42 8.2 82
  55 2.9 29
  56 28 280
  57 7.99 80
  58 99.99 999
  59 3.8 38
  72 2.1 21
  114 3 30