ACCESSION: MSBNK-Fac_Eng_Univ_Tokyo-JP000355
RECORD_TITLE: 1,2,3,4-TETRAHYDRO-TRANS-2-PHENYL-1-NAPHTHOL; EI-B; MS
DATE: 2016.01.19 (Created 2008.10.21, modified 2011.05.06)
AUTHORS: SASAKI S, TOYOHASHI UNIV. OF TECH.
LICENSE: CC BY-NC-SA

CH$NAME: 1,2,3,4-TETRAHYDRO-TRANS-2-PHENYL-1-NAPHTHOL
CH$COMPOUND_CLASS: N/A
CH$FORMULA: C16H16O
CH$EXACT_MASS: 224.12012
CH$SMILES: N/A
CH$IUPAC: N/A

AC$INSTRUMENT: HITACHI RMU-6D
AC$INSTRUMENT_TYPE: EI-B
AC$MASS_SPECTROMETRY: MS_TYPE MS
AC$MASS_SPECTROMETRY: ION_MODE POSITIVE
AC$MASS_SPECTROMETRY: IONIZATION_ENERGY 70 eV

MS$FOCUSED_ION: ION_TYPE [M]+*

PK$SPLASH: splash10-0a4i-1290000000-e4f5f1b0cb169e7f63eb
PK$NUM_PEAK: 29
PK$PEAK: m/z int. rel.int.
  91 13 130
  92 6.7 67
  103 2 20
  104 0.1 1
  105 0.7 7
  115 2 20
  119 6.7 67
  120 6.3 63
  121 5 50
  128 4 40
  129 1.3 13
  130 0.03 0
  131 0.3 3
  132 0.7 7
  133 2.3 23
  134 0.07 1
  146 3 30
  147 0.7 7
  191 2 20
  196 0.07 1
  204 1 10
  205 4.3 43
  206 99.99 999
  207 1.5 15
  208 1 10
  222 0.8 8
  224 13 130
  225 0.23 2
  226 0.8 8