ACCESSION: MSBNK-Fac_Eng_Univ_Tokyo-JP000565
RECORD_TITLE: DECANOIC ACID TRIMETHYLSILYL ESTER; EI-B; MS
DATE: 2016.01.19 (Created 2008.10.21, modified 2011.05.06)
AUTHORS: KOGA M, UNIV. OF OCCUPATIONAL AND ENVIRONMENTAL HEALTH
LICENSE: CC BY-NC-SA

CH$NAME: DECANOIC ACID TRIMETHYLSILYL ESTER
CH$COMPOUND_CLASS: N/A
CH$FORMULA: C13H28O2Si
CH$EXACT_MASS: 244.18586
CH$SMILES: CCCCCCCCCC(=O)O[Si](C)(C)C
CH$IUPAC: InChI=1S/C13H28O2Si/c1-5-6-7-8-9-10-11-12-13(14)15-16(2,3)4/h5-12H2,1-4H3
CH$LINK: CAS 55494-15-0
CH$LINK: INCHIKEY FGTNBYWFNITQJR-UHFFFAOYSA-N
CH$LINK: COMPTOX DTXSID90334700

AC$INSTRUMENT: JEOL JMS-01-SG
AC$INSTRUMENT_TYPE: EI-B
AC$MASS_SPECTROMETRY: MS_TYPE MS
AC$MASS_SPECTROMETRY: ION_MODE POSITIVE
AC$MASS_SPECTROMETRY: IONIZATION_ENERGY 70 eV

MS$FOCUSED_ION: ION_TYPE [M]+*

PK$SPLASH: splash10-00vi-9410000000-55e39b3c9e43d3024524
PK$NUM_PEAK: 16
PK$PEAK: m/z int. rel.int.
  43 10.6 106
  45 11 110
  55 19.3 193
  61 0.76 8
  73 99.99 999
  74 10.8 108
  75 85.6 856
  76 0.72 7
  81 8.4 84
  95 7.2 72
  117 63.5 635
  129 2.03 20
  131 16.5 165
  132 19.5 195
  145 11.8 118
  229 38.7 387