ACCESSION: MSBNK-Fac_Eng_Univ_Tokyo-JP000621
RECORD_TITLE: GLUCOSYLCERAMIDE; FD-B; MS
DATE: 2016.01.19 (Created 2008.10.21, modified 2011.05.06)
AUTHORS: KUSHI Y, DEPT. OF BIOCHEMISTRY, FAC. OF MEDICINE, TOKYO MEDICAL AND DENTAL UNIV.
LICENSE: CC BY-NC-SA

CH$NAME: GLUCOSYLCERAMIDE
CH$NAME: 1-O-GLUCOSYL-N-TETRACOSANYL-4-SPHINGENINE
CH$COMPOUND_CLASS: N/A
CH$FORMULA: C48H93NO8
CH$EXACT_MASS: 811.69012
CH$SMILES: N/A
CH$IUPAC: N/A

AC$INSTRUMENT: Unknown
AC$INSTRUMENT_TYPE: FD-B
AC$MASS_SPECTROMETRY: MS_TYPE MS
AC$MASS_SPECTROMETRY: ION_MODE POSITIVE

MS$FOCUSED_ION: ION_TYPE [M]+*

PK$SPLASH: splash10-03di-0100000490-053045405215d2192878
PK$NUM_PEAK: 16
PK$PEAK: m/z int. rel.int.
  104 36 360
  163 1.1 11
  239 5.8 58
  573 0.13 1
  574 2 20
  650 5.2 52
  793 1.3 13
  794 8.61 86
  795 52.3 523
  796 20.6 206
  811 5.8 58
  812 99.99 999
  813 52.8 528
  814 1.9 19
  834 8.3 83
  835 1.9 19