ACCESSION: MSBNK-Fac_Eng_Univ_Tokyo-JP000910
RECORD_TITLE: CAMPHOR; EI-B; MS
DATE: 2016.01.19 (Created 2008.10.21, modified 2011.05.06)
AUTHORS: KAMEOKA H, DEPT. OF APPLIED CHEMISTRY, FAC. OF SCI. AND ENGINEERING, KINKI UNIV.
LICENSE: CC BY-NC-SA

CH$NAME: CAMPHOR
CH$NAME: 2-OXOBORNANE
CH$COMPOUND_CLASS: N/A
CH$FORMULA: C10H16O
CH$EXACT_MASS: 152.12012
CH$SMILES: O=C(C1)C(C)(C2)C(C)(C)C(C2)1
CH$IUPAC: InChI=1S/C10H16O/c1-9(2)7-4-5-10(9,3)8(11)6-7/h7H,4-6H2,1-3H3
CH$LINK: INCHIKEY DSSYKIVIOFKYAU-UHFFFAOYSA-N
CH$LINK: COMPTOX DTXSID5030955

AC$INSTRUMENT: SHIMADZU LKB-9000B
AC$INSTRUMENT_TYPE: EI-B
AC$MASS_SPECTROMETRY: MS_TYPE MS
AC$MASS_SPECTROMETRY: ION_MODE POSITIVE
AC$MASS_SPECTROMETRY: IONIZATION_ENERGY 70 eV

MS$FOCUSED_ION: ION_TYPE [M]+*

PK$SPLASH: splash10-05mn-9100000000-1fee5995ad259c69d84a
PK$NUM_PEAK: 14
PK$PEAK: m/z int. rel.int.
  41 24 240
  43 28 280
  55 40 400
  57 0.8 8
  67 6 60
  69 52 520
  80 10 100
  81 6.8 68
  83 36 360
  95 99.99 999
  108 28 280
  109 2.6 26
  110 14 140
  152 22 220