ACCESSION: MSBNK-Fac_Eng_Univ_Tokyo-JP001097
RECORD_TITLE: PARA-BUTYLBENZOIC ACID TRIMETHYLSILYL ESTER; EI-B; MS
DATE: 2016.01.19 (Created 2008.10.21, modified 2011.05.06)
AUTHORS: KOGA M, UNIV. OF OCCUPATIONAL AND ENVIRONMENTAL HEALTH
LICENSE: CC BY-NC-SA

CH$NAME: PARA-BUTYLBENZOIC ACID TRIMETHYLSILYL ESTER
CH$NAME: TRIMETHYLSILYL 4-BUTYLBENZOATE
CH$COMPOUND_CLASS: N/A
CH$FORMULA: C14H22O2Si
CH$EXACT_MASS: 250.13891
CH$SMILES: CCCCc(c1)ccc(c1)C(=O)O[Si](C)(C)C
CH$IUPAC: InChI=1S/C14H22O2Si/c1-5-6-7-12-8-10-13(11-9-12)14(15)16-17(2,3)4/h8-11H,5-7H2,1-4H3
CH$LINK: INCHIKEY QCIYBSTWFOLQPL-UHFFFAOYSA-N

AC$INSTRUMENT: JEOL JMS-01-SG
AC$INSTRUMENT_TYPE: EI-B
AC$MASS_SPECTROMETRY: MS_TYPE MS
AC$MASS_SPECTROMETRY: ION_MODE POSITIVE
AC$MASS_SPECTROMETRY: IONIZATION_ENERGY 70 eV

MS$FOCUSED_ION: ION_TYPE [M]+*

PK$SPLASH: splash10-01pc-7960000000-71d82bd795ea9c7553da
PK$NUM_PEAK: 27
PK$PEAK: m/z int. rel.int.
  45 34.8 348
  47 11.6 116
  51 6 60
  55 0.73 7
  65 8.9 89
  73 27.4 274
  75 12.3 123
  77 2.19 22
  78 5.4 54
  89 9.6 96
  90 27.1 271
  91 4.51 45
  92 6 60
  103 7.3 73
  105 6 60
  118 1.61 16
  133 7 70
  148 6.1 61
  161 77.6 776
  162 0.96 10
  191 61.6 616
  192 14.4 144
  193 13 130
  235 99.99 999
  236 19.7 197
  237 6.1 61
  250 7 70