ACCESSION: MSBNK-Fac_Eng_Univ_Tokyo-JP001232
RECORD_TITLE: 1,2,3,4-TETRAHYDRO-CIS-3-METHYLNAPHTHALEN-1-OL; EI-B; MS
DATE: 2016.01.19 (Created 2008.10.21, modified 2011.05.06)
AUTHORS: SASAKI S, TOYOHASHI UNIV. OF TECH.
LICENSE: CC BY-NC-SA

CH$NAME: 1,2,3,4-TETRAHYDRO-CIS-3-METHYLNAPHTHALEN-1-OL
CH$COMPOUND_CLASS: N/A
CH$FORMULA: C11H14O
CH$EXACT_MASS: 162.10447
CH$SMILES: N/A
CH$IUPAC: N/A

AC$INSTRUMENT: HITACHI RMU-6D
AC$INSTRUMENT_TYPE: EI-B
AC$MASS_SPECTROMETRY: MS_TYPE MS
AC$MASS_SPECTROMETRY: ION_MODE POSITIVE
AC$MASS_SPECTROMETRY: IONIZATION_ENERGY 70 eV

MS$FOCUSED_ION: ION_TYPE [M]+*

PK$SPLASH: splash10-004l-3900000000-adcc0e43404e0806227f
PK$NUM_PEAK: 84
PK$PEAK: m/z int. rel.int.
  27 4 40
  28 1 10
  29 1.7 17
  38 0.1 1
  39 12 120
  40 1 10
  41 6 60
  42 0.07 1
  43 3 30
  44 0.3 3
  45 0.6 6
  49 0.3 3
  50 10 100
  51 3 30
  52 2.3 23
  54 0.17 2
  55 0.3 3
  56 0.3 3
  57 0.7 7
  62 0.2 2
  63 9.4 94
  64 3.3 33
  65 12 120
  66 0.1 1
  68 0.3 3
  69 1 10
  70 0.7 7
  71 0.2 2
  72 0.7 7
  73 0.3 3
  74 2 20
  75 0.33 3
  76 2.3 23
  77 14 140
  78 9 90
  79 0.3 3
  86 0.7 7
  87 1 10
  88 0.7 7
  89 0.8 8
  90 4 40
  91 39 390
  92 9 90
  93 0.1 1
  98 0.3 3
  99 0.7 7
  100 0.3 3
  101 0.17 2
  102 4.3 43
  103 4 40
  104 1.7 17
  105 1.4 14
  106 1 10
  113 0.7 7
  114 0.7 7
  115 2.3 23
  116 5.3 53
  117 6 60
  118 5 50
  119 4 40
  120 65 650
  121 5.3 53
  126 2 20
  127 1.4 14
  128 39 390
  129 99.99 999
  130 11.3 113
  131 0.33 3
  132 0.7 7
  133 1 10
  134 0.3 3
  139 0.13 1
  140 0.7 7
  141 3.3 33
  142 2 20
  143 1.1 11
  144 54 540
  145 9.7 97
  146 1.2 12
  147 0.1 1
  161 18 180
  162 20 200
  163 2 20
  164 0.3 3