ACCESSION: MSBNK-Fac_Eng_Univ_Tokyo-JP001235
RECORD_TITLE: 1,2,3,4-TETRAHYDRO-TRANS-3-METHYLNAPHTHALEN-1-OL; EI-B; MS
DATE: 2016.01.19 (Created 2008.10.21, modified 2011.05.06)
AUTHORS: SASAKI S, TOYOHASHI UNIV. OF TECH.
LICENSE: CC BY-NC-SA

CH$NAME: 1,2,3,4-TETRAHYDRO-TRANS-3-METHYLNAPHTHALEN-1-OL
CH$COMPOUND_CLASS: N/A
CH$FORMULA: C11H14O
CH$EXACT_MASS: 162.10447
CH$SMILES: N/A
CH$IUPAC: N/A

AC$INSTRUMENT: HITACHI RMU-6D
AC$INSTRUMENT_TYPE: EI-B
AC$MASS_SPECTROMETRY: MS_TYPE MS
AC$MASS_SPECTROMETRY: ION_MODE POSITIVE
AC$MASS_SPECTROMETRY: IONIZATION_ENERGY 15 eV

MS$FOCUSED_ION: ION_TYPE [M]+*

PK$SPLASH: splash10-002f-0900000000-ad9cd4ccc8bdb3836e42
PK$NUM_PEAK: 19
PK$PEAK: m/z int. rel.int.
  91 0.7 7
  92 0.7 7
  105 3 30
  118 0.17 2
  119 2 20
  120 42.3 423
  121 3.3 33
  128 0.07 1
  129 55 550
  130 5 50
  131 0.3 3
  143 0.2 2
  144 99.99 999
  145 12 120
  146 0.3 3
  147 0.07 1
  161 12 120
  162 27 270
  163 1.7 17