ACCESSION: MSBNK-Fac_Eng_Univ_Tokyo-JP001236
RECORD_TITLE: 1,2,3,4-TETRAHYDRO-CIS-3-METHYL-1-NAPHTHYLACETATE; EI-B; MS
DATE: 2016.01.19 (Created 2008.10.21, modified 2011.05.06)
AUTHORS: SASAKI S, TOYOHASHI UNIV. OF TECH.
LICENSE: CC BY-NC-SA

CH$NAME: 1,2,3,4-TETRAHYDRO-CIS-3-METHYL-1-NAPHTHYLACETATE
CH$COMPOUND_CLASS: N/A
CH$FORMULA: C13H16O2
CH$EXACT_MASS: 204.11503
CH$SMILES: N/A
CH$IUPAC: N/A

AC$INSTRUMENT: HITACHI RMU-6D
AC$INSTRUMENT_TYPE: EI-B
AC$MASS_SPECTROMETRY: MS_TYPE MS
AC$MASS_SPECTROMETRY: ION_MODE POSITIVE
AC$MASS_SPECTROMETRY: IONIZATION_ENERGY 70 eV

MS$FOCUSED_ION: ION_TYPE [M]+*

PK$SPLASH: splash10-004l-3900000000-942174ef86101734057a
PK$NUM_PEAK: 59
PK$PEAK: m/z int. rel.int.
  39 4 40
  41 2 20
  43 32 320
  44 0.03 0
  45 0.7 7
  50 0.7 7
  51 4 40
  52 0.03 0
  53 0.3 3
  55 0.7 7
  62 0.3 3
  63 0.3 3
  64 2.3 23
  65 5.3 53
  67 0.3 3
  71 0.03 0
  75 0.7 7
  76 0.3 3
  77 5.3 53
  78 0.2 2
  79 0.7 7
  87 1 10
  89 3 30
  90 0.4 4
  91 21 210
  92 1.7 17
  102 1.3 13
  103 0.23 2
  104 0.7 7
  105 5 50
  115 13 130
  116 0.4 4
  117 7 70
  118 4.3 43
  119 5 50
  120 1.8 18
  121 1 10
  127 6 60
  128 19.7 197
  129 99.99 999
  130 13 130
  131 2 20
  133 0.3 3
  134 0.4 4
  141 2 20
  142 1 10
  143 11 110
  144 7 70
  145 21.3 213
  146 2 20
  147 1 10
  158 0.33 3
  159 0.3 3
  160 1.3 13
  161 6 60
  162 2.43 24
  163 2.3 23
  175 1 10
  204 1 10