ACCESSION: MSBNK-Fac_Eng_Univ_Tokyo-JP001238
RECORD_TITLE: 1,2,3,4-TETRAHYDRO-TRANS-3-METHYL-1-NAPHTHYL ACETATE; EI-B; MS
DATE: 2016.01.19 (Created 2008.10.21, modified 2011.05.06)
AUTHORS: SASAKI S, TOYOHASHI UNIV. OF TECH.
LICENSE: CC BY-NC-SA

CH$NAME: 1,2,3,4-TETRAHYDRO-TRANS-3-METHYL-1-NAPHTHYL ACETATE
CH$COMPOUND_CLASS: N/A
CH$FORMULA: C13H16O2
CH$EXACT_MASS: 204.11503
CH$SMILES: N/A
CH$IUPAC: N/A

AC$INSTRUMENT: HITACHI RMU-6D
AC$INSTRUMENT_TYPE: EI-B
AC$MASS_SPECTROMETRY: MS_TYPE MS
AC$MASS_SPECTROMETRY: ION_MODE POSITIVE
AC$MASS_SPECTROMETRY: IONIZATION_ENERGY 70 eV

MS$FOCUSED_ION: ION_TYPE [M]+*

PK$SPLASH: splash10-004i-2900000000-efdc254a7c8a8355522a
PK$NUM_PEAK: 51
PK$PEAK: m/z int. rel.int.
  39 4 40
  41 2.3 23
  43 20 200
  44 0.03 0
  45 1 10
  50 0.7 7
  51 4 40
  52 0.03 0
  53 0.7 7
  55 0.7 7
  63 3 30
  64 0.2 2
  65 5 50
  67 0.7 7
  71 1 10
  75 0.07 1
  76 0.7 7
  77 4.7 47
  78 2 20
  89 0.3 3
  90 2.3 23
  91 18 180
  92 1.3 13
  102 0.2 2
  103 2.3 23
  104 0.7 7
  105 4 40
  115 1.3 13
  116 4.3 43
  117 8 80
  118 2 20
  119 0.4 4
  120 14.7 147
  121 1 10
  126 0.7 7
  127 0.6 6
  128 20.3 203
  129 99.99 999
  130 14 140
  131 0.2 2
  141 2 20
  142 1 10
  143 10 100
  144 7 70
  145 24 240
  146 2 20
  147 0.7 7
  161 0.4 4
  162 20 200
  163 2 20
  204 1 10