ACCESSION: MSBNK-Fac_Eng_Univ_Tokyo-JP001250
RECORD_TITLE: (CIS)FLAVAN-4-OL ACETATE; EI-B; MS
DATE: 2016.01.19 (Created 2008.10.21, modified 2011.05.06)
AUTHORS: SASAKI S, TOYOHASHI UNIV. OF TECH.
LICENSE: CC BY-NC-SA

CH$NAME: (CIS)FLAVAN-4-OL ACETATE
CH$NAME: CIS-2-PHENYLCHROMAN-4-YL ACETATE
CH$COMPOUND_CLASS: N/A
CH$FORMULA: C17H16O3
CH$EXACT_MASS: 268.10994
CH$SMILES: N/A
CH$IUPAC: N/A

AC$INSTRUMENT: HITACHI RMU-6D
AC$INSTRUMENT_TYPE: EI-B
AC$MASS_SPECTROMETRY: MS_TYPE MS
AC$MASS_SPECTROMETRY: ION_MODE POSITIVE
AC$MASS_SPECTROMETRY: IONIZATION_ENERGY 15 eV

MS$FOCUSED_ION: ION_TYPE [M]+*

PK$SPLASH: splash10-0a4i-0090000000-269b2ed827c6be0dcb1b
PK$NUM_PEAK: 12
PK$PEAK: m/z int. rel.int.
  43 2.2 22
  60 4 40
  130 0.6 6
  131 1.5 15
  132 1.2 12
  165 0.4 4
  179 0.6 6
  180 0.08 1
  207 47.2 472
  208 99.99 999
  209 15 150
  210 1 10