ACCESSION: MSBNK-Fac_Eng_Univ_Tokyo-JP001261
RECORD_TITLE: (CIS)ISOFLAVAN-4-OL ACETATE; EI-B; MS
DATE: 2016.01.19 (Created 2008.10.21, modified 2011.05.06)
AUTHORS: SASAKI S, TOYOHASHI UNIV. OF TECH.
LICENSE: CC BY-NC-SA

CH$NAME: (CIS)ISOFLAVAN-4-OL ACETATE
CH$NAME: CIS-3-PHENYLCHROMAN-4-YL ACETATE
CH$COMPOUND_CLASS: N/A
CH$FORMULA: C17H16O3
CH$EXACT_MASS: 268.10994
CH$SMILES: N/A
CH$IUPAC: N/A

AC$INSTRUMENT: HITACHI RMU-6D
AC$INSTRUMENT_TYPE: EI-B
AC$MASS_SPECTROMETRY: MS_TYPE MS
AC$MASS_SPECTROMETRY: ION_MODE POSITIVE
AC$MASS_SPECTROMETRY: IONIZATION_ENERGY 15 eV

MS$FOCUSED_ION: ION_TYPE [M]+*

PK$SPLASH: splash10-0a4i-0090000000-0cd707e4917755a2a03b
PK$NUM_PEAK: 15
PK$PEAK: m/z int. rel.int.
  43 1.6 16
  60 3 30
  104 0.8 8
  122 0.46 5
  130 0.6 6
  131 12 120
  132 0.8 8
  179 0.04 0
  180 0.4 4
  207 39 390
  208 99.99 999
  209 0.1 1
  226 1 10
  268 4.2 42
  269 0.8 8