ACCESSION: MSBNK-Fac_Eng_Univ_Tokyo-JP001356
RECORD_TITLE: N,N-BIS(TERT-BUTYLDIMETHYLSILYL)ANILINE; EI-B; MS
DATE: 2016.01.19 (Created 2008.10.21, modified 2011.05.06)
AUTHORS: MASS SPECTROSCOPY SOC. OF JAPAN (MSSJ)
LICENSE: CC BY-NC-SA

CH$NAME: N,N-BIS(TERT-BUTYLDIMETHYLSILYL)ANILINE
CH$COMPOUND_CLASS: N/A
CH$FORMULA: C18H35NSi2
CH$EXACT_MASS: 321.23080
CH$SMILES: c(c1)ccc(c1)N([Si](C)(C)C(C)(C)C)[Si](C)(C)C(C)(C)C
CH$IUPAC: InChI=1S/C18H35NSi2/c1-17(2,3)20(7,8)19(16-14-12-11-13-15-16)21(9,10)18(4,5)6/h11-15H,1-10H3
CH$LINK: INCHIKEY PUCQSUCIXUFKSK-UHFFFAOYSA-N

AC$INSTRUMENT: JEOL JMS-D-3000
AC$INSTRUMENT_TYPE: EI-B
AC$MASS_SPECTROMETRY: MS_TYPE MS
AC$MASS_SPECTROMETRY: ION_MODE POSITIVE
AC$MASS_SPECTROMETRY: IONIZATION_ENERGY 70 eV

MS$FOCUSED_ION: ION_TYPE [M]+*

PK$SPLASH: splash10-0229-6290000000-4d916f0b986e99383db6
PK$NUM_PEAK: 69
PK$PEAK: m/z int. rel.int.
  43 2.92 29
  45 9.74 97
  46 1.08 11
  50 1.18 12
  51 1.57 16
  52 1.05 11
  53 1.57 16
  55 1.97 20
  56 5.49 55
  57 7.86 79
  58 2.53 25
  59 14.11 141
  60 1.38 14
  65 1.38 14
  66 1.67 17
  70 1.44 14
  73 82.42 824
  74 7.43 74
  75 3.91 39
  77 1.08 11
  84 2.73 27
  85 1.67 17
  86 1.28 13
  91 1.87 19
  93 4.37 44
  95 1.64 16
  97 1.15 12
  99 2.5 25
  100 4.21 42
  103 1.08 11
  105 1.28 13
  107 1.11 11
  113 1.08 11
  119 4.31 43
  120 2.13 21
  121 1.64 16
  130 4.6 46
  131 1.15 12
  132 1.44 14
  134 1.84 18
  135 1.48 15
  146 1.15 12
  148 1.51 15
  149 1.44 14
  150 11.64 116
  151 1.8 18
  160 3.09 31
  162 1.77 18
  176 2.5 25
  178 1.54 15
  190 1.02 10
  192 13.58 136
  193 3.29 33
  194 1.64 16
  206 12.07 121
  207 1.21 12
  208 5.33 53
  222 60.44 604
  223 13.45 135
  224 5.33 53
  225 1.08 11
  248 4.57 46
  249 1.38 14
  264 99.99 999
  265 25.73 257
  266 9.77 98
  267 2.04 20
  306 3.55 36
  307 1.31 13