ACCESSION: MSBNK-Fac_Eng_Univ_Tokyo-JP001594
RECORD_TITLE: FLUORENE; EI-B; MS
DATE: 2016.01.19 (Created 2008.10.21, modified 2011.05.06)
AUTHORS: KOGA M, UNIV. OF OCCUPATIONAL AND ENVIRONMENTAL HEALTH
LICENSE: CC BY-NC-SA

CH$NAME: FLUORENE
CH$COMPOUND_CLASS: N/A
CH$FORMULA: C13H10
CH$EXACT_MASS: 166.07825
CH$SMILES: c(c3)cc(C1)c(c3)c(c2)c(ccc2)1
CH$IUPAC: InChI=1S/C13H10/c1-3-7-12-10(5-1)9-11-6-2-4-8-13(11)12/h1-8H,9H2
CH$LINK: CAS 86-73-7
CH$LINK: INCHIKEY NIHNNTQXNPWCJQ-UHFFFAOYSA-N
CH$LINK: COMPTOX DTXSID8024105

AC$INSTRUMENT: VARIAN MAT-44
AC$INSTRUMENT_TYPE: EI-B
AC$MASS_SPECTROMETRY: MS_TYPE MS
AC$MASS_SPECTROMETRY: ION_MODE POSITIVE
AC$MASS_SPECTROMETRY: IONIZATION_ENERGY 70 eV

MS$FOCUSED_ION: ION_TYPE [M]+*

PK$SPLASH: splash10-0159-7900000000-247b16c4daf5a17a0cc0
PK$NUM_PEAK: 40
PK$PEAK: m/z int. rel.int.
  43 1.28 13
  44 1.13 11
  50 4.98 50
  51 7.12 71
  52 1.42 14
  55 2.42 24
  56 1.7 17
  57 1.13 11
  61 1.56 16
  62 6.26 63
  63 14.52 145
  64 1.99 20
  65 2.42 24
  68 1.56 16
  69 10.68 107
  70 11.53 115
  74 4.84 48
  75 3.98 40
  76 2.7 27
  77 1.42 14
  81 15.24 152
  82 60.68 607
  83 35.61 356
  86 3.13 31
  87 4.27 43
  88 1.85 19
  89 4.27 43
  98 1.28 13
  113 1.99 20
  115 5.69 57
  137 1.28 13
  138 1.13 11
  139 6.69 67
  162 2.56 26
  163 15.09 151
  164 15.24 152
  165 88.6 886
  166 99.99 999
  167 15.09 151
  168 2.56 26