ACCESSION: MSBNK-Fac_Eng_Univ_Tokyo-JP002612
RECORD_TITLE: 9-METHYLPHENANTHRENE; EI-B; MS
DATE: 2016.01.19 (Created 2008.10.21, modified 2011.05.06)
AUTHORS: YAMAMOTO M, DEP. CHEMISTRY, FAC. SCIENCE, NARA WOMEN'S UNIV.
LICENSE: CC BY-NC-SA

CH$NAME: 9-METHYLPHENANTHRENE
CH$COMPOUND_CLASS: N/A
CH$FORMULA: C15H12
CH$EXACT_MASS: 192.09390
CH$SMILES: Cc(c1)c(c3)c(ccc3)c(c2)c(ccc2)1
CH$IUPAC: InChI=1S/C15H12/c1-11-10-12-6-2-3-8-14(12)15-9-5-4-7-13(11)15/h2-10H,1H3
CH$LINK: INCHIKEY DALBHIYZSZZWBS-UHFFFAOYSA-N
CH$LINK: COMPTOX DTXSID4061258

AC$INSTRUMENT: HITACHI M-80
AC$INSTRUMENT_TYPE: EI-B
AC$MASS_SPECTROMETRY: MS_TYPE MS
AC$MASS_SPECTROMETRY: ION_MODE POSITIVE
AC$MASS_SPECTROMETRY: IONIZATION_ENERGY 20 eV

MS$FOCUSED_ION: ION_TYPE [M]+*

PK$SPLASH: splash10-0006-0900000000-d9ebbd82431161ee9678
PK$NUM_PEAK: 21
PK$PEAK: m/z int. rel.int.
  96 0.36 4
  115 0.19 2
  139 0.17 2
  151 0.35 4
  152 0.72 7
  153 0.1 1
  163 0.24 2
  164 0.41 4
  165 12.39 124
  166 1.89 19
  167 0.14 1
  176 1.75 18
  177 0.39 4
  178 0.76 8
  188 0.36 4
  189 10.41 104
  190 5.9 59
  191 35.63 356
  192 99.99 999
  193 15.09 151
  194 1.14 11