ACCESSION: MSBNK-Fac_Eng_Univ_Tokyo-JP003413
RECORD_TITLE: ACETOPHENONE; EI-B; MS
DATE: 2016.01.19 (Created 2008.10.21, modified 2011.05.06)
AUTHORS: KOGA M, UNIV. OF OCCUPATIONAL AND ENVIRONMENTAL HEALTH
LICENSE: CC BY-NC-SA

CH$NAME: ACETOPHENONE
CH$COMPOUND_CLASS: N/A
CH$FORMULA: C8H8O
CH$EXACT_MASS: 120.05751
CH$SMILES: CC(=O)c(c1)cccc1
CH$IUPAC: InChI=1S/C8H8O/c1-7(9)8-5-3-2-4-6-8/h2-6H,1H3
CH$LINK: INCHIKEY KWOLFJPFCHCOCG-UHFFFAOYSA-N
CH$LINK: COMPTOX DTXSID6021828

AC$INSTRUMENT: JEOL JMS-01-SG-2
AC$INSTRUMENT_TYPE: EI-B
AC$MASS_SPECTROMETRY: MS_TYPE MS
AC$MASS_SPECTROMETRY: ION_MODE POSITIVE
AC$MASS_SPECTROMETRY: IONIZATION_ENERGY 75 eV

MS$FOCUSED_ION: ION_TYPE [M]+*

PK$SPLASH: splash10-0pdi-9600000000-d687340f90f63f7dc2db
PK$NUM_PEAK: 6
PK$PEAK: m/z int. rel.int.
  50 18.3 183
  51 40.5 405
  77 95.5 955
  78 4.4 44
  105 99.99 999
  120 14.5 145