ACCESSION: MSBNK-Fac_Eng_Univ_Tokyo-JP003588
RECORD_TITLE: OLEYL AMIDE; EI-B; MS
DATE: 2016.01.19 (Created 2008.10.21, modified 2011.05.06)
AUTHORS: MASS SPECTROSCOPY SOC. OF JAPAN (MSSJ)
LICENSE: CC BY-NC-SA

CH$NAME: OLEYL AMIDE
CH$COMPOUND_CLASS: N/A
CH$FORMULA: C18H35NO
CH$EXACT_MASS: 281.27186
CH$SMILES: CCCCCCCCC=CCCCCCCCC(N)=O
CH$IUPAC: InChI=1S/C18H35NO/c1-2-3-4-5-6-7-8-9-10-11-12-13-14-15-16-17-18(19)20/h9-10H,2-8,11-17H2,1H3,(H2,19,20)/b10-9-
CH$LINK: INCHIKEY FATBGEAMYMYZAF-KTKRTIGZSA-N
CH$LINK: COMPTOX DTXSID6027137

AC$INSTRUMENT: Unknown
AC$INSTRUMENT_TYPE: EI-B
AC$MASS_SPECTROMETRY: MS_TYPE MS
AC$MASS_SPECTROMETRY: ION_MODE POSITIVE

MS$FOCUSED_ION: ION_TYPE [M]+*

PK$SPLASH: splash10-0a4i-9000000000-82979114d02d916c656e
PK$NUM_PEAK: 42
PK$PEAK: m/z int. rel.int.
  27 5.67 57
  29 14.62 146
  39 4.48 45
  41 31 310
  42 4.8 48
  43 27.39 274
  44 12.33 123
  53 2.25 23
  54 6.66 67
  55 30.5 305
  56 7.18 72
  57 12.9 129
  59 99.99 999
  60 11.56 116
  67 9.13 91
  68 3.09 31
  69 17.73 177
  70 4.55 46
  71 4.92 49
  72 45.68 457
  73 6.79 68
  81 8.03 80
  82 3.89 39
  83 8.4 84
  84 3.74 37
  85 2.65 27
  86 4.59 46
  95 4.17 42
  96 2.89 29
  97 6.27 63
  98 6.23 62
  100 2.82 28
  109 2.23 22
  110 2.27 23
  111 2.57 26
  112 4.22 42
  114 3.62 36
  122 2.59 26
  126 4.26 43
  128 3.27 33
  136 2.17 22
  281 2.49 25