ACCESSION: MSBNK-Fac_Eng_Univ_Tokyo-JP003612
RECORD_TITLE: N,N-DIMETHYLCYCLOHEXYLAMINE; EI-B; MS
DATE: 2016.01.19 (Created 2008.10.21, modified 2011.05.06)
AUTHORS: MASS SPECTROSCOPY SOC. OF JAPAN (MSSJ)
LICENSE: CC BY-NC-SA

CH$NAME: N,N-DIMETHYLCYCLOHEXYLAMINE
CH$COMPOUND_CLASS: N/A
CH$FORMULA: C8H17N
CH$EXACT_MASS: 127.13610
CH$SMILES: CN(C)C(C1)CCCC1
CH$IUPAC: InChI=1S/C8H17N/c1-9(2)8-6-4-3-5-7-8/h8H,3-7H2,1-2H3
CH$LINK: INCHIKEY SVYKKECYCPFKGB-UHFFFAOYSA-N
CH$LINK: COMPTOX DTXSID9026633

AC$INSTRUMENT: Unknown
AC$INSTRUMENT_TYPE: EI-B
AC$MASS_SPECTROMETRY: MS_TYPE MS
AC$MASS_SPECTROMETRY: ION_MODE POSITIVE

MS$FOCUSED_ION: ION_TYPE [M]+*

PK$SPLASH: splash10-001i-9000000000-2692a14ce463f62e2572
PK$NUM_PEAK: 20
PK$PEAK: m/z int. rel.int.
  28 2.2 22
  41 6 60
  42 13 130
  43 0.3 3
  44 8.3 83
  45 2 20
  53 3 30
  54 0.2 2
  55 3 30
  56 5.5 55
  58 6 60
  70 0.48 5
  71 15.5 155
  82 2 20
  84 99.99 999
  85 0.6 6
  98 4 40
  126 3 30
  127 12.4 124
  128 2.5 25