ACCESSION: MSBNK-Fac_Eng_Univ_Tokyo-JP003630
RECORD_TITLE: M-DICHLOROBENZENE; EI-B; MS
DATE: 2016.01.19 (Created 2008.10.21, modified 2011.05.06)
AUTHORS: MASS SPECTROSCOPY SOC. OF JAPAN (MSSJ)
LICENSE: CC BY-NC-SA

CH$NAME: M-DICHLOROBENZENE
CH$COMPOUND_CLASS: N/A
CH$FORMULA: C6H4Cl2
CH$EXACT_MASS: 145.96901
CH$SMILES: Clc(c1)cc(Cl)cc1
CH$IUPAC: InChI=1S/C6H4Cl2/c7-5-2-1-3-6(8)4-5/h1-4H
CH$LINK: INCHIKEY ZPQOPVIELGIULI-UHFFFAOYSA-N
CH$LINK: COMPTOX DTXSID6022056

AC$INSTRUMENT: Unknown
AC$INSTRUMENT_TYPE: EI-B
AC$MASS_SPECTROMETRY: MS_TYPE MS
AC$MASS_SPECTROMETRY: ION_MODE POSITIVE

MS$FOCUSED_ION: ION_TYPE [M]+*

PK$SPLASH: splash10-0002-1900000000-1207145e8dd1dbd6ef68
PK$NUM_PEAK: 20
PK$PEAK: m/z int. rel.int.
  37 3 30
  38 2 20
  50 9.5 95
  51 0.3 3
  55 5 50
  73 8 80
  74 10.5 105
  75 1.75 18
  76 2.8 28
  84 2.5 25
  85 3 30
  110 0.28 3
  111 33 330
  112 3 30
  113 9 90
  146 99.99 999
  147 7 70
  148 66 660
  149 5 50
  150 10.5 105