ACCESSION: MSBNK-Fac_Eng_Univ_Tokyo-JP004118
RECORD_TITLE: N,N-DIMETHYLBENZAMIDE; EI-B; MS
DATE: 2016.01.19 (Created 2008.10.21, modified 2011.05.06)
AUTHORS: YAMAMOTO M, DEP. CHEMISTRY, FAC. SCIENCE, NARA WOMEN'S UNIV.
LICENSE: CC BY-NC-SA

CH$NAME: N,N-DIMETHYLBENZAMIDE
CH$COMPOUND_CLASS: N/A
CH$FORMULA: C9H11NO
CH$EXACT_MASS: 149.08406
CH$SMILES: CN(C)C(=O)c(c1)cccc1
CH$IUPAC: InChI=1S/C9H11NO/c1-10(2)9(11)8-6-4-3-5-7-8/h3-7H,1-2H3
CH$LINK: INCHIKEY IMNDHOCGZLYMRO-UHFFFAOYSA-N
CH$LINK: COMPTOX DTXSID4060602

AC$INSTRUMENT: HITACHI M-68
AC$INSTRUMENT_TYPE: EI-B
AC$MASS_SPECTROMETRY: MS_TYPE MS
AC$MASS_SPECTROMETRY: ION_MODE POSITIVE
AC$MASS_SPECTROMETRY: IONIZATION_ENERGY 70 eV

MS$FOCUSED_ION: ION_TYPE [M]+*

PK$SPLASH: splash10-056r-9600000000-849f35fea6958847e475
PK$NUM_PEAK: 30
PK$PEAK: m/z int. rel.int.
  14 3.1 31
  15 4.6 46
  18 18.6 186
  28 40.4 404
  29 1.7 17
  36 1.8 18
  38 1.5 15
  39 0.24 2
  40 1.1 11
  41 1.6 16
  42 10.6 106
  44 0.62 6
  50 8.8 88
  51 22.3 223
  52 2 20
  69 0.81 8
  72 3.3 33
  74 2.9 29
  75 2.4 24
  76 0.37 4
  77 67.2 672
  78 5.1 51
  91 1.5 15
  105 99.99 999
  106 9.2 92
  119 2.2 22
  131 3.1 31
  148 4.32 43
  149 27 270
  150 2.8 28