ACCESSION: MSBNK-Fac_Eng_Univ_Tokyo-JP004205
RECORD_TITLE: (2-ACETOXYETHYL)TRIMETHYLAMMONIUM BROMIDE; EI-B; MS
DATE: 2016.01.19 (Created 2008.10.21, modified 2011.05.06)
AUTHORS: ISA K, DEPT. OF CHEM., FAC. OF EDUC., FUKUI UNIV.
LICENSE: CC BY-NC-SA

CH$NAME: (2-ACETOXYETHYL)TRIMETHYLAMMONIUM BROMIDE
CH$COMPOUND_CLASS: N/A
CH$FORMULA: C7H16BrNO2
CH$EXACT_MASS: 225.03644
CH$SMILES: N/A
CH$IUPAC: N/A

AC$INSTRUMENT: JEOL JMS-01-SG
AC$INSTRUMENT_TYPE: EI-B
AC$MASS_SPECTROMETRY: MS_TYPE MS
AC$MASS_SPECTROMETRY: ION_MODE POSITIVE
AC$MASS_SPECTROMETRY: IONIZATION_ENERGY 15 eV

MS$FOCUSED_ION: ION_TYPE [M]+*

PK$SPLASH: splash10-0a4i-9000000000-a92fefb623f16d794753
PK$NUM_PEAK: 12
PK$PEAK: m/z int. rel.int.
  15 22.94 229
  30 5.59 56
  43 19.71 197
  58 99.99 999
  71 29.41 294
  79 1.15 12
  80 0.82 8
  87 8.24 82
  94 14.71 147
  106 0.56 6
  131 0.97 10
  146 0.02 0