ACCESSION: MSBNK-Fac_Eng_Univ_Tokyo-JP004882
RECORD_TITLE: (2S*,3R*)-2-BUTYL-1-METHOXY-3-METHYLBICYCLO(3,2,2)NON-6-EN-2-OL; EI-B; MS
DATE: 2016.01.19 (Created 2008.10.21, modified 2011.05.06)
AUTHORS: KATO T, DEPT. OF CHEM., FAC. OF SCI., TOHOKU UNIV.
LICENSE: CC BY-NC-SA

CH$NAME: (2S*,3R*)-2-BUTYL-1-METHOXY-3-METHYLBICYCLO(3,2,2)NON-6-EN-2-OL
CH$COMPOUND_CLASS: N/A
CH$FORMULA: C15H26O2
CH$EXACT_MASS: 238.19328
CH$SMILES: N/A
CH$IUPAC: N/A

AC$INSTRUMENT: Unknown
AC$INSTRUMENT_TYPE: EI-B
AC$MASS_SPECTROMETRY: MS_TYPE MS
AC$MASS_SPECTROMETRY: ION_MODE POSITIVE
AC$MASS_SPECTROMETRY: IONIZATION_ENERGY 25 eV

MS$FOCUSED_ION: ION_TYPE [M]+*

PK$SPLASH: splash10-00di-2900000000-1d3122f78600d338e7ed
PK$NUM_PEAK: 57
PK$PEAK: m/z int. rel.int.
  43 16 160
  44 3.1 31
  55 6.1 61
  57 1.68 17
  58 3.8 38
  67 4.6 46
  69 4.6 46
  71 0.31 3
  72 3.8 38
  79 3.8 38
  80 4.6 46
  83 0.38 4
  84 33.6 336
  85 13 130
  86 4.6 46
  91 0.31 3
  92 4.6 46
  93 10.7 107
  95 3.8 38
  96 0.46 5
  97 5.3 53
  105 5.3 53
  107 15.3 153
  108 1.53 15
  109 22.1 221
  110 21.4 214
  111 16.8 168
  112 0.76 8
  121 55 550
  122 32.1 321
  123 99.99 999
  124 4.27 43
  125 13 130
  126 3.1 31
  127 4.6 46
  135 0.53 5
  136 5.3 53
  139 4.6 46
  147 3.1 31
  148 0.31 3
  149 9.9 99
  150 4.6 46
  151 4.6 46
  153 0.99 10
  154 3.1 31
  163 19.8 198
  164 25.2 252
  165 0.31 3
  177 6.1 61
  181 15.3 153
  205 4.6 46
  206 0.53 5
  220 10.7 107
  234 5.3 53
  236 5.3 53
  238 2.6 26
  239 4.6 46