ACCESSION: MSBNK-Fac_Eng_Univ_Tokyo-JP005007
RECORD_TITLE: (29H,31H-PHTHALOCYANINATO(2-)-N(29),N(30),N(31),N(32))PLATINUM; EI-B; MS
DATE: 2016.01.19 (Created 2008.10.21, modified 2011.05.06)
AUTHORS: ISA K, FUKUI UNIV.
LICENSE: CC BY-NC-SA

CH$NAME: (29H,31H-PHTHALOCYANINATO(2-)-N(29),N(30),N(31),N(32))PLATINUM
CH$NAME: PHTHALOCYANINEPLATINUM(2)
CH$COMPOUND_CLASS: N/A
CH$FORMULA: C32H16N8Pt
CH$EXACT_MASS: 707.11457
CH$SMILES: N/A
CH$IUPAC: N/A
CH$LINK: CAS 14075-08-2

AC$INSTRUMENT: JEOL JMS-01-SG
AC$INSTRUMENT_TYPE: EI-B
AC$MASS_SPECTROMETRY: MS_TYPE MS
AC$MASS_SPECTROMETRY: ION_MODE POSITIVE
AC$MASS_SPECTROMETRY: IONIZATION_ENERGY 15 eV

MS$FOCUSED_ION: ION_TYPE [M]+*

PK$SPLASH: splash10-0a4i-0000000900-9738b8ce5343c6468f34
PK$NUM_PEAK: 15
PK$PEAK: m/z int. rel.int.
  128 1 10
  322 2 20
  323 3 30
  324 3 30
  353 5 50
  353.5 9 90
  354 9 90
  354.5 7 70
  706 72 720
  707 99.99 999
  708 90 900
  709 83 830
  710 26 260
  711 26 260
  712 11 110