ACCESSION: MSBNK-Fac_Eng_Univ_Tokyo-JP005009
RECORD_TITLE: (29H,31H-PHTHALOCYANINATO(2-)-N(29),N(30),N(31),N(32))COBALT; EI-B; MS
DATE: 2016.01.19 (Created 2008.10.21, modified 2011.05.06)
AUTHORS: ISA K, FUKUI UNIV.
LICENSE: CC BY-NC-SA

CH$NAME: (29H,31H-PHTHALOCYANINATO(2-)-N(29),N(30),N(31),N(32))COBALT
CH$NAME: PHTHALOCYANINECOBALT(2)
CH$COMPOUND_CLASS: N/A
CH$FORMULA: C32H16CoN8
CH$EXACT_MASS: 571.08299
CH$SMILES: N/A
CH$IUPAC: N/A
CH$LINK: CAS 3317-67-7

AC$INSTRUMENT: JEOL JMS-01-SG
AC$INSTRUMENT_TYPE: EI-B
AC$MASS_SPECTROMETRY: MS_TYPE MS
AC$MASS_SPECTROMETRY: ION_MODE POSITIVE
AC$MASS_SPECTROMETRY: IONIZATION_ENERGY 15 eV

MS$FOCUSED_ION: ION_TYPE [M]+*

PK$SPLASH: splash10-00di-0100090000-87868a0e89c013753d35
PK$NUM_PEAK: 7
PK$PEAK: m/z int. rel.int.
  128 1 10
  187 14 140
  188 3 30
  285.5 8 80
  571 99.99 999
  572 40 400
  573 9 90