ACCESSION: MSBNK-Fac_Eng_Univ_Tokyo-JP005449
RECORD_TITLE: (1R*,2S*)-3-METHYL-1-(P-METHOXYPHENYL)-2-(1-PYRROLIDINYL)BUTANOL; EI-B; MS
DATE: 2016.01.19 (Created 2008.10.21, modified 2011.05.06)
AUTHORS: HIRAMA M, TOHOKU UNIV. FACULTY OF SCIENCE DEPT. OF CHEMISTRY YUKIBUNSEKI
LICENSE: CC BY-NC-SA

CH$NAME: (1R*,2S*)-3-METHYL-1-(P-METHOXYPHENYL)-2-(1-PYRROLIDINYL)BUTANOL
CH$COMPOUND_CLASS: N/A
CH$FORMULA: C16H25NO2
CH$EXACT_MASS: 263.18853
CH$SMILES: N/A
CH$IUPAC: N/A

AC$INSTRUMENT: HITACHI M-52
AC$INSTRUMENT_TYPE: EI-B
AC$MASS_SPECTROMETRY: MS_TYPE MS
AC$MASS_SPECTROMETRY: ION_MODE POSITIVE
AC$MASS_SPECTROMETRY: IONIZATION_ENERGY 25 eV

MS$FOCUSED_ION: ION_TYPE [M]+*

PK$SPLASH: splash10-004i-0900000000-dfef3d2d33811dac2e9a
PK$NUM_PEAK: 2
PK$PEAK: m/z int. rel.int.
  126 99.99 999
  263 0.01 0