ACCESSION: MSBNK-Fac_Eng_Univ_Tokyo-JP005480
RECORD_TITLE: N,N,2,2-TETRAMETHYL-1-PHNYLTHIOPROPYLAMINE; EI-B; MS
DATE: 2016.01.19 (Created 2008.10.21, modified 2011.05.06)
AUTHORS: HIRAMA M, TOHOKU UNIV. FACULTY OF SCIENCE DEPT. OF CHEMISTRY YUKIBUNSEKI
LICENSE: CC BY-NC-SA

CH$NAME: N,N,2,2-TETRAMETHYL-1-PHNYLTHIOPROPYLAMINE
CH$COMPOUND_CLASS: N/A
CH$FORMULA: C13H21NS
CH$EXACT_MASS: 223.13947
CH$SMILES: CN(C)C(Sc(c1)cccc1)C(C)(C)C
CH$IUPAC: InChI=1S/C13H21NS/c1-13(2,3)12(14(4)5)15-11-9-7-6-8-10-11/h6-10,12H,1-5H3
CH$LINK: INCHIKEY KXIPIPMMTWKHNV-UHFFFAOYSA-N

AC$INSTRUMENT: HITACHI M-52
AC$INSTRUMENT_TYPE: EI-B
AC$MASS_SPECTROMETRY: MS_TYPE MS
AC$MASS_SPECTROMETRY: ION_MODE POSITIVE
AC$MASS_SPECTROMETRY: IONIZATION_ENERGY 14 eV

MS$FOCUSED_ION: ION_TYPE [M]+*

PK$SPLASH: splash10-03di-0900000000-af39fb0f116c3b508c9d
PK$NUM_PEAK: 5
PK$PEAK: m/z int. rel.int.
  58 4.85 49
  110 80.14 801
  111 1.13 11
  114 99.99 999
  115 5.06 51