ACCESSION: MSBNK-Fac_Eng_Univ_Tokyo-JP005574
RECORD_TITLE: 3-(TETRAHYDRO-2-FURANYL)-5-FLUOROURACIL; CI-B; MS
DATE: 2016.01.19 (Created 2008.10.21, modified 2011.05.06)
AUTHORS: MASS SPECTROSCOPY SOC. OF JAPAN (MSSJ)
LICENSE: CC BY-NC-SA

CH$NAME: 3-(TETRAHYDRO-2-FURANYL)-5-FLUOROURACIL
CH$COMPOUND_CLASS: N/A
CH$FORMULA: C8H9FN2O3
CH$EXACT_MASS: 200.05972
CH$SMILES: FC(=C2)C(=O)N(C(=O)N2)C(C1)OCC1
CH$IUPAC: InChI=1S/C8H9FN2O3/c9-5-4-10-8(13)11(7(5)12)6-2-1-3-14-6/h4,6H,1-3H2,(H,10,13)
CH$LINK: INCHIKEY MGYWDJWGVICAEL-UHFFFAOYSA-N
CH$LINK: COMPTOX DTXSID30980821

AC$INSTRUMENT: JEOL JMS-D-300
AC$INSTRUMENT_TYPE: CI-B
AC$MASS_SPECTROMETRY: MS_TYPE MS
AC$MASS_SPECTROMETRY: ION_MODE POSITIVE
AC$MASS_SPECTROMETRY: IONIZATION_ENERGY 200 eV
AC$MASS_SPECTROMETRY: REAGENT_GAS AMMONIA

PK$SPLASH: splash10-014i-0090000000-f0a2b7c4ba8b0e6c9f4b
PK$NUM_PEAK: 4
PK$PEAK: m/z int. rel.int.
  200 8 80
  201 14 140
  218 99.99 999
  219 16 160