ACCESSION: MSBNK-Fac_Eng_Univ_Tokyo-JP005758
RECORD_TITLE: N,N-DIMETHYLANILINE; EI-B; MS
DATE: 2016.01.19 (Created 2008.10.21, modified 2011.05.06)
AUTHORS: MASS SPECTROSCOPY SOC. OF JAPAN (MSSJ)
LICENSE: CC BY-NC-SA

CH$NAME: N,N-DIMETHYLANILINE
CH$COMPOUND_CLASS: N/A
CH$FORMULA: C8H11N
CH$EXACT_MASS: 121.08915
CH$SMILES: CN(C)c(c1)cccc1
CH$IUPAC: InChI=1S/C8H11N/c1-9(2)8-6-4-3-5-7-8/h3-7H,1-2H3
CH$LINK: CAS 121-69-7
CH$LINK: INCHIKEY JLTDJTHDQAWBAV-UHFFFAOYSA-N
CH$LINK: COMPTOX DTXSID2020507

AC$INSTRUMENT: HITACHI M-80
AC$INSTRUMENT_TYPE: EI-B
AC$MASS_SPECTROMETRY: MS_TYPE MS
AC$MASS_SPECTROMETRY: ION_MODE POSITIVE
AC$MASS_SPECTROMETRY: IONIZATION_ENERGY 70 eV

MS$FOCUSED_ION: ION_TYPE [M]+*

PK$SPLASH: splash10-00di-5900000000-85d8ed115885f58b6fc3
PK$NUM_PEAK: 57
PK$PEAK: m/z int. rel.int.
  37 0.63 6
  38 3.14 31
  39 12.18 122
  40 1.54 15
  47 1.07 11
  49 0.21 2
  50 3.57 36
  51 8.26 83
  52 6.88 69
  53 6.78 68
  54 4.47 45
  55 1.07 11
  59 1.78 18
  60 1.96 20
  61 2.41 24
  62 1.82 18
  63 4.8 48
  64 1.43 14
  65 7.4 74
  66 2.76 28
  67 2.55 26
  68 1.68 17
  69 0.9 9
  70 0.2 2
  73 0.25 3
  74 0.78 8
  75 0.85 9
  76 1.3 13
  77 16.98 170
  78 10.19 102
  79 6.33 63
  80 3.4 34
  81 1.72 17
  82 2.39 24
  83 0.39 4
  89 1.5 15
  90 0.67 7
  91 11.48 115
  92 3.04 30
  93 5.62 56
  94 2.5 25
  95 1.33 13
  96 0.78 8
  102 1.35 14
  103 7.4 74
  104 4.65 47
  105 2.39 24
  106 61.99 620
  107 4.85 49
  117 0.97 10
  118 2.68 27
  119 1.81 18
  120 49.43 494
  121 99.99 999
  122 9.27 93
  123 0.33 3
  124 0.65 7