ACCESSION: MSBNK-Fac_Eng_Univ_Tokyo-JP005799
RECORD_TITLE: (1ALPHA,2BETA,5ALPHA)-2-METHYL-5-(1-METHYLETHENYL)CYCLOHEXANOL; EI-B; MS
DATE: 2016.01.19 (Created 2008.10.21, modified 2011.05.06)
AUTHORS: FUJISE Y, HAMAMATSU UNIV. SCHOOL OF MEDICINE
LICENSE: CC BY-NC-SA

CH$NAME: (1ALPHA,2BETA,5ALPHA)-2-METHYL-5-(1-METHYLETHENYL)CYCLOHEXANOL
CH$NAME: DIHYDROCARVEOL
CH$COMPOUND_CLASS: N/A
CH$FORMULA: C10H18O
CH$EXACT_MASS: 154.13577
CH$SMILES: N/A
CH$IUPAC: N/A
CH$LINK: CAS 38049-26-2

AC$INSTRUMENT: JEOL JMS-D-300
AC$INSTRUMENT_TYPE: EI-B
AC$MASS_SPECTROMETRY: MS_TYPE MS
AC$MASS_SPECTROMETRY: ION_MODE POSITIVE
AC$MASS_SPECTROMETRY: IONIZATION_ENERGY 70 eV

MS$FOCUSED_ION: ION_TYPE [M]+*

PK$SPLASH: splash10-05mo-9300000000-272a3ec9e0e7beca3aea
PK$NUM_PEAK: 70
PK$PEAK: m/z int. rel.int.
  51 1.61 16
  52 6.14 61
  53 2.6 26
  54 21.56 216
  55 4.01 40
  56 40.93 409
  57 12.13 121
  58 15 150
  59 2.65 27
  61 1.04 10
  63 1.35 14
  65 8.33 83
  66 3.64 36
  67 46.4 464
  68 53.22 532
  69 33.17 332
  70 13.22 132
  71 14.06 141
  72 10.1 101
  77 16.92 169
  78 5 50
  79 51.3 513
  80 16.35 164
  81 51.09 511
  82 17.03 170
  83 15.88 159
  84 9.89 99
  85 2.34 23
  91 20.41 204
  92 25.57 256
  93 99.99 999
  94 38.85 389
  95 24.37 244
  96 14.68 147
  97 26.61 266
  98 4.58 46
  99 4.06 41
  101 1.19 12
  105 6.71 67
  106 2.34 23
  107 53.9 539
  108 13.85 139
  109 3.22 32
  110 4.47 45
  111 11.35 114
  112 3.22 32
  113 1.04 10
  115 1.3 13
  116 1.25 13
  117 1.66 17
  118 0.98 10
  119 8.02 80
  120 1.66 17
  121 66.4 664
  122 5.26 53
  123 2.23 22
  128 1.4 14
  129 0.88 9
  130 1.09 11
  131 1.09 11
  134 3.43 34
  135 1.82 18
  136 58.85 589
  137 6.92 69
  139 4.32 43
  145 1.19 12
  149 1.04 10
  152 1.09 11
  153 1.04 10
  154 2.34 23