ACCESSION: MSBNK-Fac_Eng_Univ_Tokyo-JP006182
RECORD_TITLE: 2-ETHOXYETHYL ACETATE; CI-B; MS
DATE: 2016.01.19 (Created 2008.10.21, modified 2011.05.06)
AUTHORS: HASHIMOTO K, KYOTO COLLEGE OF PHARMACY
LICENSE: CC BY-NC-SA

CH$NAME: 2-ETHOXYETHYL ACETATE
CH$COMPOUND_CLASS: N/A
CH$FORMULA: C6H12O3
CH$EXACT_MASS: 132.07864
CH$SMILES: CCOCCOC(C)=O
CH$IUPAC: InChI=1S/C6H12O3/c1-3-8-4-5-9-6(2)7/h3-5H2,1-2H3
CH$LINK: INCHIKEY SVONRAPFKPVNKG-UHFFFAOYSA-N
CH$LINK: COMPTOX DTXSID9021928

AC$INSTRUMENT: HITACHI M-80
AC$INSTRUMENT_TYPE: CI-B
AC$MASS_SPECTROMETRY: MS_TYPE MS
AC$MASS_SPECTROMETRY: ION_MODE POSITIVE
AC$MASS_SPECTROMETRY: IONIZATION_ENERGY 100 eV
AC$MASS_SPECTROMETRY: REAGENT_GAS ISOBUTANE

PK$SPLASH: splash10-000i-9000000000-a64277c5a28da5270af7
PK$NUM_PEAK: 4
PK$PEAK: m/z int. rel.int.
  72 6.04 60
  73 11.77 118
  87 99.99 999
  88 6.38 64