ACCESSION: MSBNK-Fac_Eng_Univ_Tokyo-JP006200
RECORD_TITLE: 2-ETHOXYETHANOL; CI-B; MS
DATE: 2016.01.19 (Created 2008.10.21, modified 2011.05.06)
AUTHORS: HASHIMOTO K, KYOTO COLLEGE OF PHARMACY
LICENSE: CC BY-NC-SA

CH$NAME: 2-ETHOXYETHANOL
CH$NAME: CELLOSOLVE
CH$COMPOUND_CLASS: N/A
CH$FORMULA: C4H10O2
CH$EXACT_MASS: 90.06808
CH$SMILES: CCOCCO
CH$IUPAC: InChI=1S/C4H10O2/c1-2-6-4-3-5/h5H,2-4H2,1H3
CH$LINK: INCHIKEY ZNQVEEAIQZEUHB-UHFFFAOYSA-N
CH$LINK: COMPTOX DTXSID7024087

AC$INSTRUMENT: HITACHI M-80
AC$INSTRUMENT_TYPE: CI-B
AC$MASS_SPECTROMETRY: MS_TYPE MS
AC$MASS_SPECTROMETRY: ION_MODE POSITIVE
AC$MASS_SPECTROMETRY: IONIZATION_ENERGY 100 eV
AC$MASS_SPECTROMETRY: REAGENT_GAS ISOBUTANE

PK$SPLASH: splash10-0006-9000000000-c8c2d9fbc9c8dd7db345
PK$NUM_PEAK: 5
PK$PEAK: m/z int. rel.int.
  72 1.61 16
  73 6.89 69
  91 99.99 999
  92 5.08 51
  181 2.83 28